{"text_format":"1","workbook":"xlsx","n_sheets":6,"sheets":["Instruktioner (SV)","Instructions (EN)","Frågebanken","Helper","tblMASTER","Blad1"],"not_rendered":{"charts":0,"images":2,"macros":1,"external_links":0,"defined_names":5,"comments":0,"pivot_tables":0},"unopened":[],"bounds":{"document_bytes":16777216,"sheet_cells":100000,"rows_first":2000,"rows_last":500,"rows_between":2000,"halvings":0,"cell_chars":16384,"cell_head_chars":4096},"cells_cut":0,"cells_raw":0,"read":"whole","date_system":"1900"}

{"sheet":"Instruktioner (SV)","index":0,"n_rows":26,"n_cols":2,"rows_kept":26,"cut":false,"hidden":false,"merged":[[0,0,0,2]]}
["Instruktioner för användning av\n frågebanken för kursvärderingar vid KI\n\nÖvergripande principer för frågebanken"]
[null,"\nFrågebanken bygger på följande principer:\n\n   •\t   tydliga och konkreta formuleringar\n   •\t   fokus på lärande och studentupplevelse\n   •\t   balans mellan process och resultat\n   •\t   möjlighet till flexibel användning\n   •\t   minimering av överlapp mellan områden\n   •\t   användbarhet för kvalitetsutveckling\n   •\t   psykometrisk kvalitet\n   •\t   stöd för inkluderande och studentcentrerad utbildning\n\nFrågorna är utvecklade för att användas som programspecifika och kursspecifika frågor i kursvärderingar på grundnivå och avancerad nivå vid KI och ska ses som ett stöd för professionellt och systematiskt kvalitetsarbete inom utbildning. \n"]
[null,"Syfte med frågebanken"]
[null,"\nFrågebanken är framtagen för att stödja kursansvariga lärare, examinatorer, programdirektorer och andra utbildningsansvariga vid Karolinska Institutet i arbetet med att utforma kursvärderingar av hög kvalitet. Frågorna är utvecklade för att kunna användas flexibelt i olika utbildningar, kurser och undervisningsformer samt för att bidra till ett systematiskt kvalitetsarbete inom utbildning på grundnivå och avancerad nivå.\n\nFrågebanken bygger på KI:s pedagogiska grundsyn, högskolepedagogisk forskning, principer för god frågekonstruktion och psykometriska principer för utvärdering. Syftet är att skapa relevanta, tydliga och användbara frågor som kan ge underlag för utveckling av undervisning, lärandemiljö och studenternas lärande.\n\nFrågorna är inte avsedda att användas som fasta skalor eller standardiserade index, utan som en flexibel resurs där användaren väljer frågor utifrån kursens syfte, innehåll och pedagogiska upplägg.\n"]
[null,"Målgrupp"]
[null,"\nFrågebanken riktar sig främst till:\n\n   •   \tKursansvariga lärare\n   •   \tExaminatorer\n   •   \tProgramdirektorer\n   •   \tUtbildningsnämnder och programnämnder\n   •   \tUtbildningsadministratörer\n   •   \tPedagogiska utvecklare\n   •   \tArbetsgrupper för kvalitetsutveckling\n\nKursvärderingen som skickas ut efter avslutad kurs bör inkludera samtliga frågor som är relevanta för kursen, inklusive eventuella frågor om VIL/VFU och andra specifika moment. För kurser som innehåller VIL/VFU finns särskilda mallar i KI Survey som program kan välja att använda. På det sättet kan antalet separata enkäter till studenterna minska, eftersom studenterna upplever en viss enkättrötthet.\n"]
[null,"Hur frågebanken bör användas"]
[null,"Använd aspekterna för att välja relevanta frågor"]
[null,"\nFrågebanken är organiserad i områden, aspekter och frågor. Varje område innehåller flera aspekter som representerar centrala dimensioner av området. Aspekterna hjälper användaren att välja frågor som är relevanta för kursens syfte och pedagogiska upplägg.\n\nAspekterna hjälper användaren att:\n\n   •   \tidentifiera vilka delar av kursen som ska utvärderas\n   •   \tvälja frågor som kompletterar varandra\n   •   \tundvika överlappande frågor\n   •   \tsäkerställa att olika dimensioner av studenternas erfarenheter fångas \n\nExempel:\nOm en kurs vill undersöka studentcentrerat och aktivt lärande kan frågor väljas från olika aspekter såsom:\n\n   •   \taktivt deltagande\n   •   \tsjälvständigt lärande\n   •   \tåterkoppling och formativ bedömning\n   •   \treflektion över självbedömning\n\nDet rekommenderas att välja frågor från flera relevanta aspekter snarare än många frågor från samma aspekt.\n\nAspekterna kan också användas för att:\n\n   •   \tidentifiera styrkor och utvecklingsområden i kursen\n   •   \tanalysera resultat på en mer detaljerad nivå\n   •   \tskapa balans mellan olika pedagogiska perspektiv i kursvärderingen"]
[null,"Svarsalternativ och skattningsskala"]
{"$rows_left_out":17}
{"sheet":"Instructions (EN)","index":1,"n_rows":26,"n_cols":2,"rows_kept":26,"cut":false,"hidden":false,"merged":[[0,0,0,2]]}
["Instructions for Using the KI Course \nEvaluation Question Bank\n\nOverall Principles of the Question Bank"]
[null,"\nThe questions have been developed to function across different educational contexts at KI and should be regarded as a resource for professional and systematic quality enhancement in education.\n\nThe question bank is based on the following principles:\n\n   •   \t clear and concrete wording\n   •   \t focus on learning and the student experience\n   •   \t balance between process and outcome\n   •   \t flexibility in use\n   •   \t minimization of overlap between areas\n   •   \t usefulness for quality enhancement\n   •   \t psychometric quality\n   •   \t support for inclusive and student-centred education\n\nThe questions are designed for use as course- and programme-specific items in first- and second-cycle courses at KI, and are intended to support professional and systematic quality development in education.\n"]
[null,"Purpose of the Question Bank"]
[null,"\nThe question bank has been developed to support course leaders, examiners, programme directors, and other educational stakeholders at Karolinska Institutet in designing high-quality course evaluations. The questions are intended to be used flexibly across different programmes, courses, and teaching formats, while also supporting systematic quality assurance and educational development at undergraduate and master’s levels.\n\nThe question bank is grounded in KI’s educational principles, higher education pedagogical research, principles of good questionnaire design, and psychometric principles for evaluation. The aim is to provide relevant, clear, and useful questions that can support the development of teaching, learning environments, and student learning.\n\nThe questions are not intended to function as fixed scales or standardized indices, but rather as a flexible resource where users select questions based on the course’s purpose, content, and pedagogical design.\n"]
[null,"Target Audience"]
[null,"\nThe question bank is primarily intended for:\n\n   •  \t Course leaders\n   •  \t Examiners\n   •  \t Programme directors\n   •  \t Education and programme committees\n   •  \t Educational administrators\n   •  \t Educational developers\n   •  \t Quality development working groups\n\nThe course evaluation that is distributed after the course has been completed should include all questions relevant to the course, including any questions on workplace-based learning (VIL/VFU) and other specific components. For courses that include VIL/VFU, there are special templates in KI Survey that programmes may choose to use. This way, the number of separate surveys sent to students can be reduced, as students experience a certain degree of survey fatigue.\n"]
[null,"How the Question Bank Should Be Used"]
[null,"Use the aspects to select relevant questions"]
[null,"\nThe question bank is organized into areas, aspects, and questions. Each area in the question bank is organised into different aspects representing key dimensions of the area. The aspects are intended to help users:\n\n   •  \t identify which parts of the course should be evaluated\n   •  \t select complementary questions\n   •  \t avoid overlapping questions\n   •  \t ensure that different dimensions of the student experience are captured\n\nExample:\nIf a course aims to evaluate student-centred and active learning, questions may be selected from aspects such as:\n\n   •  \t active participation\n   •  \t self-directed learning\n   •  \t feedback and formative assessment\n   •  \t reflection on learning\n\nIt is recommended to select questions from several relevant aspects rather than many questions from the same aspect.\n\nThe aspects can also be used to:\n\n   •  \t identify strengths and areas for development\n   •  \t analyse results at a more detailed level\n   •  \t create balance between different pedagogical perspectives in the course evaluation\n"]
[null,"Response Options and Rating Scale"]
{"$rows_left_out":17}
{"sheet":"Frågebanken","index":2,"n_rows":40,"n_cols":5,"rows_kept":40,"cut":false,"hidden":false,"merged":[[7,0,7,4],[6,0,6,4],[0,0,0,3],[1,0,1,3]]}
["FRÅGEBANKEN \n(read instructions before use)"]
["Hur du använder detta dokument:\n\n1. Ladda ner en lokal kopia till din dator (Välj: \"Arkiv\" → \"Skapa en kopia\" → \"Ladda ner en kopia\")\n2. För att använda filtren, klicka på en filtreringscell (t.ex. B3 för Area), och klicka sedan på den lilla triangeln på högra sidan av cellen för att visa rullgardinsmenyn. Välj det filteralternativ du vill använda från rullgardinsmenyn.\n3. För att rensa filtren, använd knappen \"CLEAR ALL FILTERS\"\", eller välj det tomma alternativet i rullgardinsmenyn.\n\nHow to use this document: \n\n1. Download a local copy on your computer (Select: \"File\" -> \"Create a copy\" -> \"Download a copy\")\n2. To apply filters, click on a filtering cell (e.g., B3 for Area), then click on the pop-up triangle (right side of the cell) to reveal drop-down menu. Choose the filtering option from the drop-down menu.\n3. To clear the filters - use \"CLEAR ALL FILTERS\" button, or select the blank option in the drop-down menu."]
["Area:","Interprofessionell kompetens / Interprofessional competence","←Select Area"]
["Language:","SV","←Select Language"]
["Aspect:",null,"←Select Aspect"]
[]
[{"$f":"\"Description for the Area: \" & B3 & IF(SUBSTITUTE($B$4,\" \",\"\")=\"\", \" \", \" (\" & B4 & \")\")","v":"Description for the Area: Interprofessionell kompetens / Interprofessional competence (SV)"}]
[{"$f":"IF(SUBSTITUTE($B$3,\" \",\"\")=\"\",\n    \"Select Area from the dropdown menu to show the description\",\n    _xlfn.TEXTJOIN(\n        SIGN(10),\n        TRUE,\n        _xlfn.UNIQUE(\n            _xlfn._xlws.FILTER(\n                tblMASTER[Description],\n                (tblMASTER[Area] = B3) *\n                (tblMASTER[Language] = IF(SUBSTITUTE($B$4,\" \",\"\")=\"\", \"SV\", B4))\n            )\n        )\n    )\n)","v":"Utbildningen utvecklar studentens kompetens att arbeta i nära samverkan med andra professioner och discipliner. Frågebatteriet är organiserat i olika aspekter (kommunikation, samarbete/teamarbete, roller/ansvar, konflikthantering, patientsäkerhet och patient-/klientcentrering). Varje aspekt innehåller både processfrågor (som mäter lärandeaktiviteter och möjligheter) och resultatfrågor (som mäter upplevd utveckling och effekt).\nFrågorna kan användas fristående, och lärare väljer de frågor som är relevanta för sin kurs."}]
[]
["Language","Area","Aspect","Question"]
{"$rows_left_out":31}
{"sheet":"Helper","index":3,"n_rows":16,"n_cols":9,"rows_kept":16,"cut":false,"hidden":true,"merged":[]}
[null,null,null,null,"Unique Areas",null,"Unique Languages ",null,"Unique Aspects"]
[null,null,null,null,{"$f":"_xlfn.VSTACK({\" \"}, _xlfn.UNIQUE(tblMASTER[Area]))","v":" "},null,{"$f":"_xlfn.VSTACK({\" \"}, _xlfn.UNIQUE(tblMASTER[Language]))","v":" "},null,{"$f":"IF(\n    Frågebanken!B3=\" \",\n    {\" \"},\n    _xlfn.VSTACK(\n        {\" \"},\n        _xlfn.UNIQUE(\n            _xlfn._xlws.FILTER(\n                tblMASTER[Aspect],\n                (tblMASTER[Area] = Frågebanken!B3) *\n                ( (tblMASTER[Language] = Frågebanken!B4) + (Frågebanken!B4 = \" \") )\n            )\n        )\n    )\n)","v":" "}]
[null,null,null,null,"Interprofessionell kompetens / Interprofessional competence",null,"SV",null,"Kommunikation"]
[null,null,null,null,"Lärandemiljö / Learning environment",null,"EN",null,"Konflikthantering"]
[null,null,null,null,"Hållbar utveckling och professionellt ansvar / Sustainability and professional responsibility",null,null,null,"Patient-/klientcentrering"]
[null,null,null,null,"Etiska perspektiv och jämlik vård /  Ethical perspectives and equitable care",null,null,null,"Patientsäkerhet"]
[null,null,null,null,"Studentperspektiv och studentinflytande / Student perspective and student influence",null,null,null,"Roller och ansvar"]
[null,null,null,null,"Internationalisering och interkulturell kompetens / Internationalisation and intercultural competence",null,null,null,"Samarbete och teamarbete"]
[null,null,null,null,"Forskningsanknytning och vetenskapligt förhållningssätt / Research integration and scientific approach"]
[null,null,null,null,"Studentcentrerat och aktivt lärande / Student-centred and active learning"]
{"$rows_left_out":7}
{"sheet":"tblMASTER","index":4,"n_rows":561,"n_cols":5,"rows_kept":561,"cut":false,"hidden":true,"merged":[]}
["Language","Area","Aspect","Question","Description"]
["SV","Interprofessionell kompetens / Interprofessional competence","Kommunikation","Kursen har stärkt min förmåga att kommunicera i interprofessionella sammanhang.","Utbildningen utvecklar studentens kompetens att arbeta i nära samverkan med andra professioner och discipliner. Frågebatteriet är organiserat i olika aspekter (kommunikation, samarbete/teamarbete, roller/ansvar, konflikthantering, patientsäkerhet och patient-/klientcentrering). Varje aspekt innehåller både processfrågor (som mäter lärandeaktiviteter och möjligheter) och resultatfrågor (som mäter upplevd utveckling och effekt).\nFrågorna kan användas fristående, och lärare väljer de frågor som är relevanta för sin kurs."]
["SV","Interprofessionell kompetens / Interprofessional competence","Kommunikation","Kursen har stärkt min förmåga att kommunicera på ett tydligt sätt med studenter från andra professioner.","Utbildningen utvecklar studentens kompetens att arbeta i nära samverkan med andra professioner och discipliner. Frågebatteriet är organiserat i olika aspekter (kommunikation, samarbete/teamarbete, roller/ansvar, konflikthantering, patientsäkerhet och patient-/klientcentrering). Varje aspekt innehåller både processfrågor (som mäter lärandeaktiviteter och möjligheter) och resultatfrågor (som mäter upplevd utveckling och effekt).\nFrågorna kan användas fristående, och lärare väljer de frågor som är relevanta för sin kurs."]
["SV","Interprofessionell kompetens / Interprofessional competence","Kommunikation","Kursen har stärkt min förmåga att ta hänsyn till andra professioners perspektiv i mitt eget arbete.","Utbildningen utvecklar studentens kompetens att arbeta i nära samverkan med andra professioner och discipliner. Frågebatteriet är organiserat i olika aspekter (kommunikation, samarbete/teamarbete, roller/ansvar, konflikthantering, patientsäkerhet och patient-/klientcentrering). Varje aspekt innehåller både processfrågor (som mäter lärandeaktiviteter och möjligheter) och resultatfrågor (som mäter upplevd utveckling och effekt).\nFrågorna kan användas fristående, och lärare väljer de frågor som är relevanta för sin kurs."]
["SV","Interprofessionell kompetens / Interprofessional competence","Kommunikation","Kursen har utvecklat min förmåga att anpassa min kommunikation till olika professioners perspektiv.","Utbildningen utvecklar studentens kompetens att arbeta i nära samverkan med andra professioner och discipliner. Frågebatteriet är organiserat i olika aspekter (kommunikation, samarbete/teamarbete, roller/ansvar, konflikthantering, patientsäkerhet och patient-/klientcentrering). Varje aspekt innehåller både processfrågor (som mäter lärandeaktiviteter och möjligheter) och resultatfrågor (som mäter upplevd utveckling och effekt).\nFrågorna kan användas fristående, och lärare väljer de frågor som är relevanta för sin kurs."]
["SV","Interprofessionell kompetens / Interprofessional competence","Kommunikation","Kursen har utvecklat min förmåga att kommunicera respektfullt med studenter från andra professioner.","Utbildningen utvecklar studentens kompetens att arbeta i nära samverkan med andra professioner och discipliner. Frågebatteriet är organiserat i olika aspekter (kommunikation, samarbete/teamarbete, roller/ansvar, konflikthantering, patientsäkerhet och patient-/klientcentrering). Varje aspekt innehåller både processfrågor (som mäter lärandeaktiviteter och möjligheter) och resultatfrågor (som mäter upplevd utveckling och effekt).\nFrågorna kan användas fristående, och lärare väljer de frågor som är relevanta för sin kurs."]
["SV","Interprofessionell kompetens / Interprofessional competence","Kommunikation","Under kursen fick jag öva på att anpassa mitt sätt att kommunicera till olika professioners perspektiv.","Utbildningen utvecklar studentens kompetens att arbeta i nära samverkan med andra professioner och discipliner. Frågebatteriet är organiserat i olika aspekter (kommunikation, samarbete/teamarbete, roller/ansvar, konflikthantering, patientsäkerhet och patient-/klientcentrering). Varje aspekt innehåller både processfrågor (som mäter lärandeaktiviteter och möjligheter) och resultatfrågor (som mäter upplevd utveckling och effekt).\nFrågorna kan användas fristående, och lärare väljer de frågor som är relevanta för sin kurs."]
["SV","Interprofessionell kompetens / Interprofessional competence","Kommunikation","Under kursen fick jag öva på att inkludera andra professioners perspektiv i diskussioner och aktiviteter.","Utbildningen utvecklar studentens kompetens att arbeta i nära samverkan med andra professioner och discipliner. Frågebatteriet är organiserat i olika aspekter (kommunikation, samarbete/teamarbete, roller/ansvar, konflikthantering, patientsäkerhet och patient-/klientcentrering). Varje aspekt innehåller både processfrågor (som mäter lärandeaktiviteter och möjligheter) och resultatfrågor (som mäter upplevd utveckling och effekt).\nFrågorna kan användas fristående, och lärare väljer de frågor som är relevanta för sin kurs."]
["SV","Interprofessionell kompetens / Interprofessional competence","Kommunikation","Under kursen fick jag öva på att kommunicera respektfullt med studenter från andra professioner.","Utbildningen utvecklar studentens kompetens att arbeta i nära samverkan med andra professioner och discipliner. Frågebatteriet är organiserat i olika aspekter (kommunikation, samarbete/teamarbete, roller/ansvar, konflikthantering, patientsäkerhet och patient-/klientcentrering). Varje aspekt innehåller både processfrågor (som mäter lärandeaktiviteter och möjligheter) och resultatfrågor (som mäter upplevd utveckling och effekt).\nFrågorna kan användas fristående, och lärare väljer de frågor som är relevanta för sin kurs."]
["SV","Interprofessionell kompetens / Interprofessional competence","Konflikthantering","Aktiviteterna i kursen gav mig möjlighet att diskutera eller arbeta med konfliktsituationer.","Utbildningen utvecklar studentens kompetens att arbeta i nära samverkan med andra professioner och discipliner. Frågebatteriet är organiserat i olika aspekter (kommunikation, samarbete/teamarbete, roller/ansvar, konflikthantering, patientsäkerhet och patient-/klientcentrering). Varje aspekt innehåller både processfrågor (som mäter lärandeaktiviteter och möjligheter) och resultatfrågor (som mäter upplevd utveckling och effekt).\nFrågorna kan användas fristående, och lärare väljer de frågor som är relevanta för sin kurs."]
{"$rows_left_out":552}
{"sheet":"Blad1","index":5,"n_rows":0,"n_cols":0,"rows_kept":0,"cut":false,"hidden":true,"merged":[]}