{"text_format":"1","workbook":"xlsx","n_sheets":10,"sheets":["Tabeller","Uppdragsforskning","Inläsning Planner uppdrag","Bidragsforskning VR (Prisma)","Inläsning UBW Planner","Tabell Prisma","Bidragsforskning","Spec-indir-kostn-inst & -proj","Inläsning Planner","INDI FO 2025"],"not_rendered":{"charts":0,"images":0,"macros":1,"external_links":0,"defined_names":9,"comments":0,"pivot_tables":0},"unopened":[],"bounds":{"document_bytes":16777216,"sheet_cells":100000,"rows_first":2000,"rows_last":500,"rows_between":2000,"halvings":0,"cell_chars":16384,"cell_head_chars":4096},"cells_cut":0,"cells_raw":0,"read":"whole","date_system":"1900"}

{"sheet":"Tabeller","index":0,"n_rows":20,"n_cols":7,"rows_kept":20,"cut":false,"hidden":true,"merged":[]}
[2025,null,0,null,-0.05,null,"01"]
[{"$f":"A1+1","v":2026},null,{"$f":"C1+0.01","v":0.01},null,{"$f":"E1+0.01","v":-0.04},null,"02"]
[2027,null,0.02,null,{"$f":"E2+0.01","v":-0.03},null,"03"]
[2028,null,0.03,null,-1.9999999999999997E-2,null,"04"]
[2029,null,0.04,null,-9.9999999999999967E-3,null,"05"]
[2030,null,0.05,null,0,null,"06"]
[2031,null,6.0000000000000005E-2,null,0.01,null,"07"]
[2032,null,7.0000000000000007E-2,null,0.02,null,"08"]
{"$rows_left_out":13}
{"sheet":"Uppdragsforskning","index":1,"n_rows":175,"n_cols":21,"rows_kept":175,"cut":false,"hidden":false,"merged":[[123,9,123,10],[80,7,80,8],[83,2,83,5],[84,2,84,5],[85,2,85,5],[86,2,86,5],[25,20,39,25],[118,2,118,5],[119,2,119,5],[114,2,114,4],[55,3,55,4],[60,2,60,5],[61,2,61,5],[56,3,56,4],[54,3,54,4],[53,3,53,4],[52,3,52,4],[80,13,80,14],[58,13,58,14],[58,11,58,12],[108,2,108,5],[109,2,109,5],[110,2,110,5],[91,2,91,6],[2,20,24,25],[130,11,130,12],[130,13,130,14],[130,15,130,16],[91,7,91,8],[91,9,91,10],[91,11,91,12],[91,13,91,14],[91,15,91,16],[58,15,58,16],[106,15,106,16],[100,15,100,16],[95,15,95,16],[95,13,95,14],[45,7,45,8],[45,9,45,10],[45,11,45,12],[123,15,123,16],[126,20,132,25],[100,11,100,12],[100,13,100,14],[112,13,112,14],[64,13,64,14],[64,15,64,16],[154,20,175,25],[150,6,150,7],[114,13,114,14],[114,7,114,8],[114,9,114,10],[114,11,114,12],[150,9,150,10],[87,2,87,5],[88,2,88,5],[89,2,89,5],[100,7,100,8],[100,9,100,10],[95,7,95,8],[114,15,114,16],[123,11,123,12],[106,11,106,12],[106,13,106,14],[112,11,112,12],[133,20,152,25],[130,7,130,8],[130,9,130,10],[123,13,123,14],[112,2,112,6],[115,20,125,25],[127,2,127,5],[123,2,123,4],[123,7,123,8],[120,2,120,5],[112,15,112,16],[112,7,112,8],[112,9,112,10],[41,20,41,24],[42,20,65,25],[79,20,92,25],[93,20,114,25],[107,2,107,5],[101,2,101,4],[102,2,102,4],[104,2,104,4],[103,2,103,4],[97,2,97,4],[98,2,98,4],[106,7,106,8],[106,9,106,10],[48,3,48,4],[49,3,49,4],[50,3,50,4],[51,3,51,4],[80,9,80,10],[80,15,80,16],[80,11,80,12],[95,11,95,12],[64,9,64,10],[64,11,64,12],[81,2,81,5],[82,2,82,5],[95,9,95,10],[64,2,64,6],[64,7,64,8],[74,2,74,5],[75,2,75,5],[77,2,77,6],[77,7,77,8],[77,9,77,10],[77,11,77,12],[77,13,77,14],[96,2,96,4],[71,7,71,8],[71,9,71,10],[71,11,71,12],[71,13,71,14],[71,15,71,16],[77,15,77,16],[5,1,20,17],[46,3,46,4],[47,3,47,4],[42,13,42,14],[36,3,36,4],[42,7,42,8],[42,9,42,10],[42,11,42,12],[42,15,42,16],[35,3,35,4],[34,3,34,4],[45,13,45,14],[45,15,45,16],[58,7,58,8],[58,9,58,10],[72,2,72,5],[73,2,73,5]]}
[null,"UPPDRAGSFORSKNING - FULL KOSTNADSTÄCKNINGSKALKYL"]
[]
[null,null,null,null,null,null,null,null,null,null,null,null,null,null,null,null,null,null,null,null,"Instruktioner\n\nGenerellt\nMed knappen under rubriken väljs typ av mall, uppdrag / bidragskalkylmall. Det går alltid att hoppa mellan olika mallar utan att förlora inmatade uppgifter.\n\nDe vita cellerna i mallen fylls i med värden och de färgade cellerna är beräkningar som filen gör automatiskt. Namn / beskrivningar som är ifyllda exempel bör raderas.\n\nGrupperingarna / plusknapparna (1, 2 och 3) ute till vänster i filen gör det möjligt att komprimera och expandera kostnads- / intäktsdetaljerna. Grupperingen / plusknappen längst upp (ovanför R kolumnen) ger utökade antal år.\n\nVid behov kan ytterligare rader och även kolumner (för år) infogas, men då med viss försiktighet då formler inte följer med automatiskt. Vid behov av ytterligare rader är rekommenderat att kopiera en hel rad  i mitten av de kostnader / intäkter där behov av ytterligare poster uppstår och sedan infoga hela den kopierade raden på samma rad. Vid behov av ytterligare år rekommenderas kontakt med EA eller att två seprata mallar nyttjas för uträkning men med olika projekt start år.\n\nOmf.%  innebär omfattning av heltid\nNyttj % innebär nyttjandegrad av resursen i procent\nFörbr % innebär förbrukningsgrad av resursen i procent\n"]
[]
[]
[null,"Inledning för uppdrag\n\nDenna mall ska enbart nyttjas internt för beräkning av pris för uppdrag inom forskning. Syftet med att uppdragsforskningsverksamheten ska nyttja denna modell är för att prissättningen ska leda till att full kostnadstäckning uppnås. Modellen är också godkänd av Ekonomistyrningsverket (ESV) via samråd som förnyas vartannat år. Samtliga uppdragskalkyler som överskrider 100 000 kr ska skrivas under av prefekt, eller av den till vilken prefekten delegerat beslutsrätten. I dessa fall ska även ett exemplar av kalkylen diarieföras och sparas.\n\nEnligt § 3 Avgiftsförordning (1992:191) får Karolinska Institutet (KI) endast ta ut avgifter för varor och/eller tjänster som myndigheten tillhandahåller om det följer av lag eller förordning eller av ett särskilt beslut av regeringen. Enligt regleringsbrevet som är en årlig skrivelse och styrande dokument från riksdagen får KI bedriva uppdragsforskning. Det ekonomiska målet är bestämt i regleringsbrevet till full kostnadstäckning. \n\nFull kostnadstäckning innebär enkelt uttryckt att verksamheten varken får generera ett överskott eller underskott över tid. Detta innebär i praktiken att målet för varje enskilt uppdrags resultat bör vara +/-noll vid uppdragets slut eller då samtliga till uppdraget hänförliga kostnader har allokerats (exempelvis; avvecklingskostnader eller avskrivningar kan kostnadsföras även efter åtagandet har fullföljts). Det är även viktigt att denna verksamhet inte bedrivs med underskott, d.v.s. att KI inte skulle få täckning för samtliga kostnader av beställaren. Därav behöver man uppskatta de förväntade kostnaderna med god eftertanke. Detta får dock heller ej leda till att uppdragsforskningsverksamheten bedrivs med ett överskott som överstiger 10 procent av omsättningen mätt i innevarande års intäkter."]
[]
[]
{"$rows_left_out":168}
{"sheet":"Inläsning Planner uppdrag","index":2,"n_rows":65,"n_cols":10,"rows_kept":65,"cut":false,"hidden":true,"merged":[[2,1,7,10]]}
[null,"UPPDRAGSFORSKNING - STÖD FÖR BUDGET TILL UBW"]
[]
[null,"Inledning\n\nDenna flik summerar kostnader och intäkter som fyllts in i kalkylfliken och återvisar dem i en budget modell som kan enkelt föras in i UBWs Saldo tabell för uppföljningsändamål. Posterna hämtas till olika konton beroende på vad som fyllts i under respektive rubrik i kalkylen. \n\nDet är möjligt att välja antingen att föra in totala förväntad utfall på första året, det under första rubriken nedan, eller en årsfördelad from första året och framåt som finns under rubriken årsfördelad budget.\n\nOBS! Kopiera endast gråa fält och klistra in direkt i UBW (Ctrl + C & Ctrl + V). Se gärna UBW handbok på medarbetarportalen för ytterligare instruktioner om hur funktionen nyttjas."]
[]
[]
[]
[]
[]
{"$rows_left_out":58}
{"sheet":"Bidragsforskning VR (Prisma)","index":3,"n_rows":131,"n_cols":31,"rows_kept":131,"cut":false,"hidden":true,"merged":[[6,7,9,19],[45,6,45,14],[46,6,46,14],[47,6,47,14],[48,6,48,14],[28,6,28,14],[29,6,29,14],[30,6,30,14],[31,6,31,14],[35,6,35,14],[36,6,36,14],[37,6,37,14],[38,6,38,14],[39,6,39,14],[17,6,17,14],[18,6,18,14],[19,6,19,14],[20,6,20,14],[21,6,21,14],[23,6,23,14],[24,6,24,14],[25,6,25,14],[26,6,26,14],[27,6,27,14],[90,1,90,16],[92,3,92,5],[93,3,93,5],[82,3,82,5],[83,3,83,5],[84,3,84,5],[85,3,85,5],[86,3,86,5],[87,3,87,5],[88,3,88,5],[89,3,89,5],[91,3,91,5],[109,3,109,5],[94,3,94,5],[95,3,95,5],[100,3,100,5],[99,3,99,5],[101,3,101,5],[102,3,102,5],[103,3,103,5],[104,3,104,5],[105,3,105,5],[106,3,106,5],[107,3,107,5],[108,3,108,5],[81,3,81,5],[35,2,35,5],[36,2,36,5],[37,2,37,5],[47,2,47,5],[48,2,48,5],[49,2,49,5],[44,2,44,5],[45,2,45,5],[46,2,46,5],[52,2,52,5],[53,2,53,5],[54,2,54,5],[55,2,55,5],[56,2,56,5],[57,2,57,5],[58,2,58,5],[59,2,59,5],[60,2,60,5],[61,2,61,5],[62,2,62,5],[63,2,63,5],[64,2,64,5],[65,2,65,5],[25,2,25,5],[26,2,26,5],[17,2,17,5],[18,2,18,5],[19,2,19,5],[20,2,20,5],[21,2,21,5],[79,3,79,5],[80,3,80,5],[66,2,66,5],[70,3,70,5],[71,2,71,5],[72,2,72,5],[73,2,73,5],[74,2,74,5],[75,2,75,5],[49,6,49,14],[22,6,22,14],[40,6,40,14],[41,6,41,14],[42,6,42,14],[43,6,43,14],[44,6,44,14],[7,3,7,5],[8,3,8,5],[9,3,9,5],[41,2,41,5],[42,2,42,5],[43,2,43,5],[38,2,38,5],[39,2,39,5],[40,2,40,5],[27,2,27,5],[28,2,28,5],[29,2,29,5],[30,2,30,5],[31,2,31,5],[22,2,22,5],[23,2,23,5],[24,2,24,5]]}
[]
[null,"GRUNDLÄGGANDE UPPGIFTER",null,null,null,null,null,null,null,null,null,null,null,null,null,null,"Klicka på + ovan för att öppna upp fler år"]
[]
[null,"Institutionskod",null,null,null,null,null,"Lönekostnadspålägg (LKP)",null,null,{"$f":"Bidragsforskning!G73","v":0.55859999999999999}]
[null,"Innevrande år",null,{"$f":"Tabeller!$A$1","v":2025},null,null,null,"Indirektakostnader - pålägg (INDI)",null,null,{"$f":"_xlfn.IFNA(VLOOKUP(LEFT(D4,2),'INDI FO 2025'!A:G,7,0),\"Välj institution\")","v":"Välj institution"}]
[null,"Projektets start år/månad"]
[null,"Projektets slut år/månad",null,null,null,null,null,"Fyll först i de grundläggande uppgifterna i denna sektion. All ekonomisk information anges i kolumn S till AE i respektive sektion. Kalkylmallen innehåller informationsrutor som beskriver respektive sektion/kolumn,  de visas när man markerar en cell.\n\nI kalkylbladet är celler innehållande formler skyddade, vill man manuellt ange/ändra något så går det att ta bort skyddet genom att i verktygsfältet välja Granska och sen alternativet Ta bort bladets skydd."]
[null,"Projektledare/-ansvarig"]
{"$rows_left_out":124}
{"sheet":"Inläsning UBW Planner","index":4,"n_rows":71,"n_cols":6,"rows_kept":71,"cut":false,"hidden":true,"merged":[]}
["Konto","Projekt","Start period","Slut period","Belopp","Text"]
[{"$f":"IF(C2=\"\",\"\",3511)","v":""},{"$f":"IF('Bidragsforskning VR (Prisma)'!$D$9=\"\",\"Ange projeknummer\",'Bidragsforskning VR (Prisma)'!$D$9)","v":"Ange projeknummer"},{"$f":"IF('Bidragsforskning VR (Prisma)'!$D$6<'Bidragsforskning VR (Prisma)'!$G$52,\"\",'Bidragsforskning VR (Prisma)'!$G$52&\"01\")","v":""},{"$f":"IF('Bidragsforskning VR (Prisma)'!$D$6<'Bidragsforskning VR (Prisma)'!$G$52,\"\",'Bidragsforskning VR (Prisma)'!$G$52&\"12\")","v":""},{"$f":"IFERROR(IF('Inläsning UBW Planner'!C2=\"\",\"\",ROUND('Bidragsforskning VR (Prisma)'!G$123,0))*-1,0)","v":0},{"$f":"\"Budget år \"&LEFT(C2,4)","v":"Budget år "}]
[4011,{"$f":"IF('Bidragsforskning VR (Prisma)'!$D$9=\"\",\"Ange projeknummer\",'Bidragsforskning VR (Prisma)'!$D$9)","v":"Ange projeknummer"},{"$f":"IF('Bidragsforskning VR (Prisma)'!$D$6<'Bidragsforskning VR (Prisma)'!$G$52,\"\",'Bidragsforskning VR (Prisma)'!$G$52&\"01\")","v":""},{"$f":"IF('Bidragsforskning VR (Prisma)'!$D$6<'Bidragsforskning VR (Prisma)'!$G$52,\"\",'Bidragsforskning VR (Prisma)'!$G$52&\"12\")","v":""},{"$f":"IFERROR(IF(C3=\"\",\"\",ROUND('Bidragsforskning VR (Prisma)'!G$117,0)),0)","v":""},{"$f":"\"Budget år \"&LEFT(C3,4)","v":"Budget år "}]
[50111,{"$f":"IF('Bidragsforskning VR (Prisma)'!$D$9=\"\",\"Ange projeknummer\",'Bidragsforskning VR (Prisma)'!$D$9)","v":"Ange projeknummer"},{"$f":"IF('Bidragsforskning VR (Prisma)'!$D$6<'Bidragsforskning VR (Prisma)'!$G$52,\"\",'Bidragsforskning VR (Prisma)'!$G$52&\"01\")","v":""},{"$f":"IF('Bidragsforskning VR (Prisma)'!$D$6<'Bidragsforskning VR (Prisma)'!$G$52,\"\",'Bidragsforskning VR (Prisma)'!$G$52&\"12\")","v":""},{"$f":"IFERROR(IF(C4=\"\",\"\",ROUND('Bidragsforskning VR (Prisma)'!G$120,0)),0)","v":""},"Budget år "]
[5871,{"$f":"IF('Bidragsforskning VR (Prisma)'!$D$9=\"\",\"Ange projeknummer\",'Bidragsforskning VR (Prisma)'!$D$9)","v":"Ange projeknummer"},{"$f":"IF('Bidragsforskning VR (Prisma)'!$D$6<'Bidragsforskning VR (Prisma)'!$G$52,\"\",'Bidragsforskning VR (Prisma)'!$G$52&\"01\")","v":""},{"$f":"IF('Bidragsforskning VR (Prisma)'!$D$6<'Bidragsforskning VR (Prisma)'!$G$52,\"\",'Bidragsforskning VR (Prisma)'!$G$52&\"12\")","v":""},{"$f":"IFERROR(IF(C5=\"\",\"\",ROUND(SUM('Bidragsforskning VR (Prisma)'!G$81:G$90),0)),0)","v":""},"Budget år "]
[57849,{"$f":"IF('Bidragsforskning VR (Prisma)'!$D$9=\"\",\"Ange projeknummer\",'Bidragsforskning VR (Prisma)'!$D$9)","v":"Ange projeknummer"},{"$f":"IF('Bidragsforskning VR (Prisma)'!$D$6<'Bidragsforskning VR (Prisma)'!$G$52,\"\",'Bidragsforskning VR (Prisma)'!$G$52&\"01\")","v":""},{"$f":"IF('Bidragsforskning VR (Prisma)'!$D$6<'Bidragsforskning VR (Prisma)'!$G$52,\"\",'Bidragsforskning VR (Prisma)'!$G$52&\"12\")","v":""},{"$f":"IFERROR(IF(C6=\"\",\"\",ROUND(SUM('Bidragsforskning VR (Prisma)'!G$92:G$96),0)),0)","v":""},"Budget år "]
[6911,{"$f":"IF('Bidragsforskning VR (Prisma)'!$D$9=\"\",\"Ange projeknummer\",'Bidragsforskning VR (Prisma)'!$D$9)","v":"Ange projeknummer"},{"$f":"IF('Bidragsforskning VR (Prisma)'!$D$6<'Bidragsforskning VR (Prisma)'!$G$52,\"\",'Bidragsforskning VR (Prisma)'!$G$52&\"01\")","v":""},{"$f":"IF('Bidragsforskning VR (Prisma)'!$D$6<'Bidragsforskning VR (Prisma)'!$G$52,\"\",'Bidragsforskning VR (Prisma)'!$G$52&\"12\")","v":""},{"$f":"IFERROR(IF(C7=\"\",\"\",ROUND('Bidragsforskning VR (Prisma)'!G$119,0)),0)","v":""},"Budget år "]
[49988,{"$f":"IF('Bidragsforskning VR (Prisma)'!$D$9=\"\",\"Ange projeknummer\",'Bidragsforskning VR (Prisma)'!$D$9)","v":"Ange projeknummer"},{"$f":"IF('Bidragsforskning VR (Prisma)'!$D$6<'Bidragsforskning VR (Prisma)'!$G$52,\"\",'Bidragsforskning VR (Prisma)'!$G$52&\"01\")","v":""},{"$f":"IF('Bidragsforskning VR (Prisma)'!$D$6<'Bidragsforskning VR (Prisma)'!$G$52,\"\",'Bidragsforskning VR (Prisma)'!$G$52&\"12\")","v":""},{"$f":"IFERROR(IF(C8=\"\",\"\",ROUND('Bidragsforskning VR (Prisma)'!G$122,0)),0)","v":""},"Budget år "]
{"$rows_left_out":64}
{"sheet":"Tabell Prisma","index":5,"n_rows":6,"n_cols":1,"rows_kept":6,"cut":false,"hidden":true,"merged":[]}
["Doktorand"]
["Medverkande administratör"]
["Medverkande forskare"]
["Projektledare"]
["Övrig disputerad personal"]
["Övrig ej disputerad personal"]

{"sheet":"Bidragsforskning","index":6,"n_rows":175,"n_cols":21,"rows_kept":175,"cut":false,"hidden":false,"merged":[[123,2,123,4],[124,2,124,4],[126,2,126,4],[125,2,125,4],[97,2,97,6],[97,7,97,8],[97,9,97,10],[97,11,97,12],[118,2,118,4],[120,2,120,4],[111,2,111,5],[97,13,97,14],[97,15,97,16],[92,20,95,25],[101,15,101,16],[128,15,128,16],[128,7,128,8],[118,20,136,25],[114,20,117,25],[101,20,113,25],[122,11,122,12],[122,13,122,14],[134,15,134,16],[136,15,136,16],[122,7,122,8],[122,9,122,10],[113,13,113,14],[128,13,128,14],[128,9,128,10],[2,20,23,25],[153,2,153,4],[154,2,154,4],[101,9,101,10],[44,20,44,24],[32,3,32,4],[31,3,31,4],[39,7,39,8],[39,9,39,10],[39,11,39,12],[39,13,39,14],[101,7,101,8],[74,7,74,8],[74,9,74,10],[74,11,74,12],[74,13,74,14],[78,7,78,8],[153,7,153,8],[153,9,153,10],[153,11,153,12],[153,13,153,14],[140,2,140,5],[141,2,141,5],[95,2,95,5],[139,2,139,5],[131,2,131,5],[132,2,132,5],[130,2,130,5],[129,2,129,5],[166,2,166,4],[166,7,166,8],[166,9,166,10],[166,11,166,12],[144,2,144,4],[144,11,144,12],[158,2,158,4],[164,2,164,4],[156,2,156,4],[161,2,161,4],[162,2,162,4],[163,2,163,4],[144,9,144,10],[136,2,136,4],[136,7,136,8],[166,13,166,14],[171,20,174,25],[173,6,173,7],[147,15,147,16],[161,7,161,8],[161,9,161,10],[161,11,161,12],[161,13,161,14],[161,15,161,16],[164,7,164,8],[164,9,164,10],[164,11,164,12],[163,7,163,8],[163,9,163,10],[147,11,147,12],[147,13,147,14],[153,15,153,16],[147,7,147,8],[154,13,154,14],[158,5,158,6],[158,9,158,10],[158,11,158,12],[137,20,145,25],[156,15,156,16],[158,15,158,16],[162,15,162,16],[163,15,163,16],[162,7,162,8],[162,9,162,10],[162,11,162,12],[162,13,162,14],[154,7,154,8],[154,9,154,10],[154,11,154,12],[163,13,163,14],[158,13,158,14],[155,13,155,14],[156,13,156,14],[155,11,155,12],[154,15,154,16],[147,9,147,10],[144,15,144,16],[144,13,144,14],[144,7,144,8],[163,11,163,12],[158,7,158,8],[45,20,66,25],[48,3,48,4],[52,3,52,4],[53,3,53,4],[54,3,54,4],[58,3,58,4],[59,3,59,4],[60,3,60,4],[51,7,51,8],[51,9,51,10],[51,11,51,12],[51,13,51,14],[57,7,57,8],[57,9,57,10],[57,11,57,12],[63,11,63,12],[63,13,63,14],[51,15,51,16],[57,15,57,16],[63,15,63,16],[45,3,45,4],[64,3,64,4],[65,3,65,4],[57,13,57,14],[85,7,85,8],[85,9,85,10],[85,11,85,12],[101,11,101,12],[101,13,101,14],[119,2,119,4],[83,7,83,8],[83,9,83,10],[117,11,117,12],[117,13,117,14],[113,7,113,8],[113,9,113,10],[113,11,113,12],[102,2,102,5],[103,2,103,5],[104,2,104,5],[105,2,105,5],[106,2,106,5],[107,2,107,5],[108,2,108,5],[83,2,83,4],[113,2,113,6],[117,7,117,8],[117,9,117,10],[81,3,81,4],[68,7,68,8],[68,9,68,10],[68,11,68,12],[68,13,68,14],[71,2,71,5],[44,3,44,4],[83,15,83,16],[63,7,63,8],[63,9,63,10],[78,9,78,10],[83,11,83,12],[83,13,83,14],[5,1,20,17],[39,15,39,16],[43,15,43,16],[66,3,66,4],[70,2,70,5],[79,3,79,4],[80,3,80,4],[78,11,78,12],[68,2,68,4],[85,15,85,16],[91,7,91,8],[91,9,91,10],[91,11,91,12],[91,13,91,14],[156,9,156,10],[156,11,156,12],[155,2,155,4],[155,15,155,16],[155,7,155,8],[136,9,136,10],[136,11,136,12],[136,13,136,14],[128,11,128,12],[134,2,134,6],[134,7,134,8],[134,9,134,10],[134,11,134,12],[134,13,134,14],[91,15,91,16],[92,2,92,5],[93,2,93,5],[94,2,94,5],[85,13,85,14],[24,20,38,25],[161,20,168,25],[150,20,159,25],[70,20,73,25],[78,20,81,25],[74,2,74,6],[68,15,68,16],[74,15,74,16],[78,15,78,16],[33,3,33,4],[43,7,43,8],[43,9,43,10],[43,11,43,12],[43,13,43,14],[78,13,78,14],[113,15,113,16],[117,15,117,16],[122,15,122,16],[85,2,85,4],[155,9,155,10],[164,13,164,14],[164,15,164,16],[166,15,166,16],[156,7,156,8]]}
[null,"BIDRAGSFORSKNING - FULL KOSTNADSTÄCKNINGSKALKYL"]
[]
[null,null,null,null,null,null,null,null,null,null,null,null,null,null,null,null,null,null,null,null,"Instruktioner\n\nGenerellt\nMed knappen under rubriken väljs typ av mall, uppdrag / bidragskalkylmall. Det går alltid att hoppa mellan olika mallar utan att förlora inmatade uppgifter.\n\nDe vita cellerna i mallen fylls i med värden och de färgade cellerna är beräkningar som filen gör automatiskt. Namn / beskrivningar som är ifyllda exempel bör raderas.\n\nGrupperingarna / plusknapparna (1, 2 och 3) ute till vänster i filen gör det möjligt att komprimera och expandera kostnads- / intäktsdetaljerna. Grupperingen / plusknappen längst upp (ovanför R kolumnen) ger utökade antal år.\n\nVid behov kan ytterligare rader och även kolumner (för år) infogas, men då med viss försiktighet då formler inte följer med automatiskt. Vid behov av ytterligare rader är rekommenderat att kopiera en hel rad  i mitten av de kostnader / intäkter där behov av ytterligare poster uppstår och sedan infoga hela den kopierade raden på samma rad. Vid behov av ytterligare år rekommenderas kontakt med EA eller att två seprata mallar nyttjas för uträkning men med olika projekt start år.\n\nOmf.%  innebär omfattning av heltid\nNyttj % innebär nyttjandegrad av resursen i procent\nFörbr % innebär förbrukningsgrad av resursen i procent\n"]
[]
[]
[null,"Inledning för bidrag\n\nMed bidrag menas medel som tas emot utan krav på motprestation i form av till exempel varor, tjänster eller särskilda förmåner. Finansiären kan dock villkora vad bidraget får användas till och dessutom ställa krav på återrapportering av hur medlen nyttjats.\n\nDenna mall är ämnad för att stötta beräkning av ett forskningsprojekts kostnader samt finansiering och därmed även det eventuella samfinansieringsbehovet som kan uppstå. Med samfinansieringsbehov i detta sammanhang menas den del av kostnader som uppstår i projektet som inte har beviljats täckning från huvudfinansiärerna.\n\nTill skillnad från uppdragsforskningskalkylmallen kan denna mall med fördel även användas som underlag att bifoga en ansökan där bidragsgivaren så kräver. Detta kan ske då de inte själva tillhandahåller någon specifik mall. Mallen i sig kan skrivas ut i komprimerad form genom grupperingsfunktionen till vänster i bladet.\n\nMallen ska alltid skrivas under av prefekt, eller av den till vilken prefekten delegerat beslutsrätten, när det ansökta bidraget överstiger 100 000 kr. I dessa fall ska ett exemplar av ansökan och kalkylen diarieföras och sparas. Vid beviljade ansökningar ska kalkylen bifogas i Avtalsreskontran i KIs affärssystem."]
[]
[]
{"$rows_left_out":168}
{"sheet":"Spec-indir-kostn-inst & -proj","index":7,"n_rows":78,"n_cols":9,"rows_kept":78,"cut":false,"hidden":false,"merged":[[15,3,15,4],[16,3,16,4],[25,2,25,3],[26,2,26,3],[2,1,7,10],[14,3,14,4],[27,2,27,3],[28,2,28,3],[29,2,29,3],[44,2,44,3],[18,2,18,3],[30,2,30,3],[31,2,31,3],[42,2,42,3],[36,2,36,3],[37,2,37,3],[38,2,38,3],[39,2,39,3],[40,2,40,3],[41,2,41,3]]}
[null,"BIDRAGSFORKSNING - BILAGA TILL FULL KOSTNADSTÄCKNINGSKALKYL"]
[]
[null,"Inledning\n\nDenna flik preciserar de gemensamma / indirekta kostnaderna (INDI) för myndigheten Karolinska Institutet, men även för utförande institution samt för det specifika projektet. Fördelningen görs på följande nivåer: Ledning, Utbildning-forskning, Ekonomi-personal, Infrastruktur-service, Bibliotek, Nivåspecifikt övrigt.\n\nSiffrorna i mallen hämtas automatiskt om uppgifterna i bidragsforksningsfliken är korrekt ifyllda."]
[]
[]
[]
[]
[]
{"$rows_left_out":71}
{"sheet":"Inläsning Planner","index":8,"n_rows":66,"n_cols":9,"rows_kept":66,"cut":false,"hidden":true,"merged":[[2,1,8,9]]}
[null,"BIDRAGSFORSKNING - STÖD FÖR BUDGET TILL UBW"]
[]
[null,"Inledning\n\nDenna flik summerar kostnader och intäkter som fyllts in i kalkylfliken och återvisar dem i en budgetmodell som enkelt kan föras in i Planner i UBW med hjälp av inläsningsmall. Posterna till olika konton hämtas beroende på vad som fyllts i under respektive rubrik i kalkylen. \n\nNedan finns två alternativ som kan nyttjas för uppföljning i UBW. Det första som återfinns under rubiken TOTAL BUDGET summerar samtliga intäkter och kostnader för projektet, och det andra som återfinns under rubriken ÅRSFÖRDELAD BUDGET fördelarar intäkter och kostnader på respektive år.\n\n"]
[]
[]
[]
[]
[]
{"$rows_left_out":59}
{"sheet":"INDI FO 2025","index":9,"n_rows":1376,"n_cols":21,"rows_kept":1376,"cut":false,"hidden":true,"merged":[[0,0,0,6]]}
["Forskning/Forskarutbildning 2025",null,null,null,null,null,null,null,null,null,"Obs kostnadsunderlag är hämtad från INDI budgeten"]
["Inst","Namn",{"$f":"A2&\" - \"&B2","v":"Inst - Namn"},"Institution","Fakultet","Universitet","Summa",null,null,null,null,null,"Kostnadsunderlag (summa kostnadsunderlag FO)","Universitetsgemensam","Univgem andel av total","Insitutionsgemensam","Summa","Andel av total","Uni"]
["C1","MTC",{"$f":"A3&\" - \"&B3","v":"C1 - MTC"},0.08,null,0.14499999999999999,{"$f":"SUM(D3:F3)","v":0.22499999999999998},null,null,null,"C1","MTC",220800,{"$f":"M3*F3","v":32015.999999999996},{"$f":"N3/$N$27","v":5.3682220313590746E-2},{"$f":"D3*M3","v":17664},{"$f":"SUM(N3:O3)","v":32016.05368222031},{"$f":"Q3/$S$27","v":5.3682310324234733E-2},{"$f":"M3*T3","v":32015.999999999996},{"$f":"N3/M3","v":0.14499999999999999}]
["C2","MBB","C2 - MBB",5.9400000000000001E-2,null,0.14499999999999999,0.2044,null,null,null,"C2","MBB",290000,{"$f":"M4*F4","v":42050},7.0506539361147272E-2,17226,42050.070506539363,{"$f":"Q4/$S$27","v":7.0506657581648896E-2},{"$f":"M4*T4","v":42050},0.14499999999999999]
["C3","FyFa","C3 - FyFa",0.08,null,0.14499999999999999,0.22499999999999998,null,null,null,"C3","FyFa",144500,{"$f":"M5*F5","v":20952.5},3.5131706681675111E-2,11560,20952.535131706682,3.5131765588097462E-2,20952.5,0.14499999999999999]
["C4","Neuro","C4 - Neuro",7.4999999999999997E-2,null,0.14499999999999999,0.21999999999999997,null,null,null,"C4","Neuro",151400,21953,3.6809276066474821E-2,11355,21953.036809276065,3.6809337785729798E-2,21953,0.14499999999999999]
["C5","CMB","C5 - CMB",7.0000000000000007E-2,null,0.14499999999999999,0.215,null,null,null,"C5","CMB",172200,24969,4.186629682065366E-2,12054.000000000002,24969.041866296822,4.1866367019172207E-2,24969,0.14499999999999999]
["C6","IMM","C6 - IMM",7.5999999999999998E-2,null,0.14499999999999999,0.22099999999999997,null,null,null,"C6","IMM",191000,27694.999999999996,4.6437065579238372E-2,14516,27695.046437065575,4.6437143441706678E-2,27694.999999999996,0.14499999999999999]
{"$rows_left_out":1368}