{"text_format":"1","workbook":"xlsx","n_sheets":10,"sheets":["Tabeller","Uppdragsforskning","Inläsning Planner uppdrag","Bidragsforskning VR (Prisma)","Inläsning UBW Planner","Tabell Prisma","Bidragsforskning","Spec-indir-kostn-inst & -proj","Inläsning Planner","INDI FO 2025"],"not_rendered":{"charts":0,"images":0,"macros":1,"external_links":0,"defined_names":9,"comments":0,"pivot_tables":0},"unopened":[],"bounds":{"document_bytes":16777216,"sheet_cells":100000,"rows_first":2000,"rows_last":500,"rows_between":2000,"halvings":0,"cell_chars":16384,"cell_head_chars":4096},"cells_cut":0,"cells_raw":0,"read":"whole","date_system":"1900"}

{"sheet":"Tabeller","index":0,"n_rows":20,"n_cols":7,"rows_kept":20,"cut":false,"hidden":true,"merged":[]}
[2025,null,0,null,-0.05,null,"01"]
[{"$f":"A1+1","v":2026},null,{"$f":"C1+0.01","v":0.01},null,{"$f":"E1+0.01","v":-0.04},null,"02"]
[2027,null,0.02,null,{"$f":"E2+0.01","v":-0.03},null,"03"]
[2028,null,0.03,null,-1.9999999999999997E-2,null,"04"]
[2029,null,0.04,null,-9.9999999999999967E-3,null,"05"]
[2030,null,0.05,null,0,null,"06"]
[2031,null,6.0000000000000005E-2,null,0.01,null,"07"]
[2032,null,7.0000000000000007E-2,null,0.02,null,"08"]
[2033,null,0.08,null,0.03,null,"09"]
[2034,null,0.09,null,0.04,null,"10"]
[2035,null,9.9999999999999992E-2,null,{"$f":"E10+0.01","v":0.05},null,"11"]
[2036,null,null,null,null,null,"12"]
[2037]
[2038]
[2039]
[2040]
[2041]
[2042]
[2043]
[2044]

{"sheet":"Uppdragsforskning","index":1,"n_rows":175,"n_cols":21,"rows_kept":175,"cut":false,"hidden":false,"merged":[[123,9,123,10],[80,7,80,8],[83,2,83,5],[84,2,84,5],[85,2,85,5],[86,2,86,5],[25,20,39,25],[118,2,118,5],[119,2,119,5],[114,2,114,4],[55,3,55,4],[60,2,60,5],[61,2,61,5],[56,3,56,4],[54,3,54,4],[53,3,53,4],[52,3,52,4],[80,13,80,14],[58,13,58,14],[58,11,58,12],[108,2,108,5],[109,2,109,5],[110,2,110,5],[91,2,91,6],[2,20,24,25],[130,11,130,12],[130,13,130,14],[130,15,130,16],[91,7,91,8],[91,9,91,10],[91,11,91,12],[91,13,91,14],[91,15,91,16],[58,15,58,16],[106,15,106,16],[100,15,100,16],[95,15,95,16],[95,13,95,14],[45,7,45,8],[45,9,45,10],[45,11,45,12],[123,15,123,16],[126,20,132,25],[100,11,100,12],[100,13,100,14],[112,13,112,14],[64,13,64,14],[64,15,64,16],[154,20,175,25],[150,6,150,7],[114,13,114,14],[114,7,114,8],[114,9,114,10],[114,11,114,12],[150,9,150,10],[87,2,87,5],[88,2,88,5],[89,2,89,5],[100,7,100,8],[100,9,100,10],[95,7,95,8],[114,15,114,16],[123,11,123,12],[106,11,106,12],[106,13,106,14],[112,11,112,12],[133,20,152,25],[130,7,130,8],[130,9,130,10],[123,13,123,14],[112,2,112,6],[115,20,125,25],[127,2,127,5],[123,2,123,4],[123,7,123,8],[120,2,120,5],[112,15,112,16],[112,7,112,8],[112,9,112,10],[41,20,41,24],[42,20,65,25],[79,20,92,25],[93,20,114,25],[107,2,107,5],[101,2,101,4],[102,2,102,4],[104,2,104,4],[103,2,103,4],[97,2,97,4],[98,2,98,4],[106,7,106,8],[106,9,106,10],[48,3,48,4],[49,3,49,4],[50,3,50,4],[51,3,51,4],[80,9,80,10],[80,15,80,16],[80,11,80,12],[95,11,95,12],[64,9,64,10],[64,11,64,12],[81,2,81,5],[82,2,82,5],[95,9,95,10],[64,2,64,6],[64,7,64,8],[74,2,74,5],[75,2,75,5],[77,2,77,6],[77,7,77,8],[77,9,77,10],[77,11,77,12],[77,13,77,14],[96,2,96,4],[71,7,71,8],[71,9,71,10],[71,11,71,12],[71,13,71,14],[71,15,71,16],[77,15,77,16],[5,1,20,17],[46,3,46,4],[47,3,47,4],[42,13,42,14],[36,3,36,4],[42,7,42,8],[42,9,42,10],[42,11,42,12],[42,15,42,16],[35,3,35,4],[34,3,34,4],[45,13,45,14],[45,15,45,16],[58,7,58,8],[58,9,58,10],[72,2,72,5],[73,2,73,5]]}
[null,"UPPDRAGSFORSKNING - FULL KOSTNADSTÄCKNINGSKALKYL"]
[]
[null,null,null,null,null,null,null,null,null,null,null,null,null,null,null,null,null,null,null,null,"Instruktioner\n\nGenerellt\nMed knappen under rubriken väljs typ av mall, uppdrag / bidragskalkylmall. Det går alltid att hoppa mellan olika mallar utan att förlora inmatade uppgifter.\n\nDe vita cellerna i mallen fylls i med värden och de färgade cellerna är beräkningar som filen gör automatiskt. Namn / beskrivningar som är ifyllda exempel bör raderas.\n\nGrupperingarna / plusknapparna (1, 2 och 3) ute till vänster i filen gör det möjligt att komprimera och expandera kostnads- / intäktsdetaljerna. Grupperingen / plusknappen längst upp (ovanför R kolumnen) ger utökade antal år.\n\nVid behov kan ytterligare rader och även kolumner (för år) infogas, men då med viss försiktighet då formler inte följer med automatiskt. Vid behov av ytterligare rader är rekommenderat att kopiera en hel rad  i mitten av de kostnader / intäkter där behov av ytterligare poster uppstår och sedan infoga hela den kopierade raden på samma rad. Vid behov av ytterligare år rekommenderas kontakt med EA eller att två seprata mallar nyttjas för uträkning men med olika projekt start år.\n\nOmf.%  innebär omfattning av heltid\nNyttj % innebär nyttjandegrad av resursen i procent\nFörbr % innebär förbrukningsgrad av resursen i procent\n"]
[]
[]
[null,"Inledning för uppdrag\n\nDenna mall ska enbart nyttjas internt för beräkning av pris för uppdrag inom forskning. Syftet med att uppdragsforskningsverksamheten ska nyttja denna modell är för att prissättningen ska leda till att full kostnadstäckning uppnås. Modellen är också godkänd av Ekonomistyrningsverket (ESV) via samråd som förnyas vartannat år. Samtliga uppdragskalkyler som överskrider 100 000 kr ska skrivas under av prefekt, eller av den till vilken prefekten delegerat beslutsrätten. I dessa fall ska även ett exemplar av kalkylen diarieföras och sparas.\n\nEnligt § 3 Avgiftsförordning (1992:191) får Karolinska Institutet (KI) endast ta ut avgifter för varor och/eller tjänster som myndigheten tillhandahåller om det följer av lag eller förordning eller av ett särskilt beslut av regeringen. Enligt regleringsbrevet som är en årlig skrivelse och styrande dokument från riksdagen får KI bedriva uppdragsforskning. Det ekonomiska målet är bestämt i regleringsbrevet till full kostnadstäckning. \n\nFull kostnadstäckning innebär enkelt uttryckt att verksamheten varken får generera ett överskott eller underskott över tid. Detta innebär i praktiken att målet för varje enskilt uppdrags resultat bör vara +/-noll vid uppdragets slut eller då samtliga till uppdraget hänförliga kostnader har allokerats (exempelvis; avvecklingskostnader eller avskrivningar kan kostnadsföras även efter åtagandet har fullföljts). Det är även viktigt att denna verksamhet inte bedrivs med underskott, d.v.s. att KI inte skulle få täckning för samtliga kostnader av beställaren. Därav behöver man uppskatta de förväntade kostnaderna med god eftertanke. Detta får dock heller ej leda till att uppdragsforskningsverksamheten bedrivs med ett överskott som överstiger 10 procent av omsättningen mätt i innevarande års intäkter."]
[]
[]
[]
[]
[]
[]
[]
[]
[]
[]
[]
[]
[]
[]
[]
[]
[]
[]
[]
[null,null,"GRUNDLÄGGANDE UPPGIFTER",null,null,null,null,null,null,null,null,null,null,null,null,null,null,null,null,null,"Grundläggande uppgifter\nHär väljs institutionskod i rullistan som påverkar de indirekta kostnaderna (INDI) både i denna mall men även värden i specifikations- och uppföljningsflikar.\n\nInnevarande år kommer upp automatiskt, men val av projektets start år påverkar Index av personal-, drift-, och lokalkostnader.\n\nFör uppdrag redogörs även om projektet är internt, statligt, externt eller övrigt uppdrag och där moms av annan anldening ska exkluderas.\n\nResten av fälten är fritextfält, men observera att framförallt projektnumret och även de andra fält hämtas upp av de övriga bladen."]
[]
[null,null,"Institutionskod"]
[null,null,"Innevrande år",{"$f":"Tabeller!$A$1","v":2025}]
[null,null,"Projektets start år/månad",2025,"01"]
[null,null,"Projektets slut år/månad",2027]
[]
[null,null,{"$f":"IF(LEFT(D28,2)=\"UF\",\"\",\"Internt/Statligt/Externt\")","v":"Internt/Statligt/Externt"}]
[]
[null,null,"Projektledare/-ansvarig"]
[null,null,"Projektnummer - UBW"]
[null,null,"Beskrivnig av projektet"]
[]
[]
[]
[null,null,{"$f":"\"PROJEKTKOSTNADER\"&\" - \"&LEFT($B$1,(LEN($B$1)-41))","v":"PROJEKTKOSTNADER - UPPDRAG"},null,null,null,null,null,null,null,null,null,null,null,null,null,null,null,null,null,"Personalkostnader"]
[null,null,null,null,null,null,null,null,null,null,null,null,null,null,null,null,null,null,null,null,"Länk till stöd för beräkning av debiterbar månadsersättning"]
[null,null,"A. Personalkostnader (gäller KI-personal)",null,null,null,null,{"$f":"IF($D$30=\"\",\"\",IF($D$29>$D$30,\"Fel i grundläggande uppgifter\",$D$30))","v":2025},null,{"$f":"IFERROR(H43+1,\"\")","v":2026},null,{"$f":"IFERROR(J43+1,\"\")","v":2027},null,{"$f":"IFERROR(L43+1,\"\")","v":2028},null,{"$f":"IFERROR(N43+1,\"\")","v":2029},null,null,null,null,"Beräkningen baserar sig på total månadsersättning och omfattning av heltid i projektet.\n\nNotera att kostnader för sjukvårdspersonal hamnar under drift.\n\nFör bidragsforksning nyttjas bruttolön och standardtiden anges automatiskt, vilket motsvarar 1680 timmar per år på KI.\n\nFör externa uppdrag ska månadsersättning baseras på debiterbar tid. Bruttolönen behöver beräknas om till debiterbar månadsersättning. Detta är högre än bruttolönen då avräkning för indirekt tid eller produktionsbortfall såsom egen- administration, utbildning och utvecklingsarbete görs. Mallen utgår ifrån en standard produktionsbortfall om 480 timmar, men denna kan enkelt justeras genom att ange nya siffror i beräkningsunderlaget längst ner i bladet. (se även länk ovan eller i rubriken för månadsersättning)\n\nIndex för personalkostnader är satt till 2% ökning per år.\n\n\n\n\n\nLKP\nLKP (Lönekostnadspålägg) är en kostnad som de flesta arbetsgivare har för den anställda utöver den individuella bruttolönen som den anställda har.\nDetta är en standardsats som revideras centralt årligen."]
[]
[]
[null,null,null,null,null,null,null,{"$f":"IF($D$30=\"\",\"\",IF($D$29>$D$30,\"Se fel i grundläggande uppgifter\",$D$30))","v":2025},null,{"$f":"IFERROR(H46+1,\"\")","v":2026},null,{"$f":"IFERROR(J46+1,\"\")","v":2027},null,{"$f":"IFERROR(L46+1,\"\")","v":2028},null,{"$f":"IFERROR(N46+1,\"\")","v":2029}]
[null,null,"Namn/Roll","Arbetsmoment/Beskrivning",null,"Antal timmar","Debiterbar månadsers. (kr)","Omf. %",{"$f":"IF($D$29=$D$30,\"inkl. index 0%\",\"inkl. index 4%\")","v":"inkl. index 0%"},"Omf. %","inkl. index 3%","Omf. %","inkl. index 3%","Omf. %","inkl. index 3%","Omf. %","inkl. index 3%"]
[null,null,null,null,null,{"$f":"IF(H48+J48+L48+N48+P48=0,0,IF($D$33=\"Internt\",(H48+J48+L48+N48+P48)*1680,(H48+J48+L48+N48+P48)*(1680-($D$170*8))))","v":3600},null,1,{"$f":"IFERROR(IF(OR($D$29=\"\",$D$30=\"\"),\"År saknas\",(($G48*12)*H48*((1+(MID(I$47,12,2))/100)^(H$46-$D$29)))),0)","v":0},1,{"$f":"IFERROR(IF(OR($D$29=\"\",$D$30=\"\"),\"År saknas\",(($G48*12)*J48*((1+(MID(K$47,12,2))/100)^(J$46-$D$29)))),0)","v":0},1,{"$f":"IFERROR(IF(OR($D$29=\"\",$D$30=\"\"),\"År saknas\",(($G48*12)*L48*((1+(MID(M$47,12,2))/100)^(L$46-$D$29)))),0)","v":0},null,{"$f":"IFERROR(IF(OR($D$29=\"\",$D$30=\"\"),\"År saknas\",(($G48*12)*N48*((1+(MID(O$47,12,2))/100)^(N$46-$D$29)))),0)","v":0},null,{"$f":"IFERROR(IF(OR($D$29=\"\",$D$30=\"\"),\"År saknas\",(($G48*12)*P48*((1+(MID(Q$47,12,2))/100)^(P$46-$D$29)))),0)","v":0}]
[null,null,null,null,null,0,null,null,{"$f":"IFERROR(IF(OR($D$29=\"\",$D$30=\"\"),\"År saknas\",(($G49*12)*H49*((1+(MID(I$47,12,2))/100)^(H$46-$D$29)))),0)","v":0},null,0,null,0,null,0,null,0]
[null,null,null,null,null,0,null,null,0,null,0,null,0,null,0,null,0]
[null,null,null,null,null,0,null,null,0,null,0,null,0,null,0,null,0]
[null,null,null,null,null,0,null,null,0,null,0,null,0,null,0,null,0]
[null,null,null,null,null,0,null,null,0,null,0,null,0,null,0,null,0]
[null,null,null,null,null,0,null,null,0,null,0,null,0,null,0,null,0]
[null,null,null,null,null,0,null,null,0,null,0,null,0,null,0,null,0]
[null,null,null,null,null,0,null,null,0,null,0,null,0,null,0,null,0]
[null,null,null,null,null,0,null,null,0,null,0,null,0,null,0,null,0]
[]
[null,null,"Summa Personalkostnader exkl. lönekostnadspålägg (LKP)",null,null,{"$f":"SUM(F$48:F57)","v":3600},{"$f":"SUM(G$48:G57)","v":0},{"$f":"SUM(I$48:I57)","v":0},null,{"$f":"SUM(K$48:K57)","v":0},null,{"$f":"SUM(M$48:M57)","v":0},null,{"$f":"SUM(O$48:O57)","v":0},null,{"$f":"SUM(Q$48:Q57)","v":0}]
[]
[null,null,"Sociala avgifter  (LKP) - 2024",null,null,null,0.55010000000000003]
[null,null,"Semestertillägg",null,null,null,1.8499999999999999E-2]
[null,null,null,null,null,"LKP Total",{"$f":"SUM(G61:G62)","v":0.56859999999999999}]
[]
[null,null,"Summa personalkostnad där lönekostnadspålägg (LKP) ingår",null,null,null,null,{"$f":"H59*(1+$G63)","v":0},null,{"$f":"J59*(1+$G63)","v":0},null,{"$f":"L59*(1+$G63)","v":0},null,{"$f":"N59*(1+$G63)","v":0},null,{"$f":"P59*(1+$G63)","v":0}]
[]
[null,null,"B. Driftkostnader"]
[]
[]
[null,null,"B.1 Resekostnader"]
[]
[null,null,null,null,null,null,null,{"$f":"IF($D$30=\"\",\"\",IF($D$29>$D$30,\"Fel i grunduppgifter\",$D$30))","v":2025},null,{"$f":"IFERROR(H72+1,\"\")","v":2026},null,{"$f":"IFERROR(J72+1,\"\")","v":2027},null,{"$f":"IFERROR(L72+1,\"\")","v":2028},null,{"$f":"IFERROR(N72+1,\"\")","v":2029}]
[null,null,"Resekostnader - beskrivning",null,null,null,"Kostnad att fördela ->","Förbr. %",{"$f":"IF($D$29=$D$30,\"inkl. index 0%\",\"inkl. index 3%\")","v":"inkl. index 0%"},"Förbr. %","inkl. index 3%","Förbr. %","inkl. index 3%","Förbr. %","inkl. index 3%","Förbr. %","inkl. index 3%"]
[null,null,"Resa 1",null,null,null,null,null,{"$f":"IF(OR($D$29=\"\",$D$30=\"\"),\"År saknas\",(($G74)*H74)*((1+(MID(I$73,12,2))/100)^(H$72-$D$29)))","v":0},null,{"$f":"IF(OR($D$29=\"\",$D$30=\"\"),\"År saknas\",(($G74)*J74)*((1+(MID(K$73,12,2))/100)^(J$72-$D$29)))","v":0},null,{"$f":"IF(OR($D$29=\"\",$D$30=\"\"),\"År saknas\",(($G74)*L74)*((1+(MID(M$73,12,2))/100)^(L$72-$D$29)))","v":0},null,{"$f":"IF(OR($D$29=\"\",$D$30=\"\"),\"År saknas\",(($G74)*N74)*((1+(MID(O$73,12,2))/100)^(N$72-$D$29)))","v":0},null,{"$f":"IF(OR($D$29=\"\",$D$30=\"\"),\"År saknas\",(($G74)*P74)*((1+(MID(Q$73,12,2))/100)^(P$72-$D$29)))","v":0}]
[null,null,"Resa 2",null,null,null,null,null,{"$f":"IF(OR($D$29=\"\",$D$30=\"\"),\"År saknas\",(($G75)*H75)*((1+(MID(I$73,12,2))/100)^(H$72-$D$29)))","v":0},null,{"$f":"IF(OR($D$29=\"\",$D$30=\"\"),\"År saknas\",(($G75)*J75)*((1+(MID(K$73,12,2))/100)^(J$72-$D$29)))","v":0},null,{"$f":"IF(OR($D$29=\"\",$D$30=\"\"),\"År saknas\",(($G75)*L75)*((1+(MID(M$73,12,2))/100)^(L$72-$D$29)))","v":0},null,{"$f":"IF(OR($D$29=\"\",$D$30=\"\"),\"År saknas\",(($G75)*N75)*((1+(MID(O$73,12,2))/100)^(N$72-$D$29)))","v":0},null,{"$f":"IF(OR($D$29=\"\",$D$30=\"\"),\"År saknas\",(($G75)*P75)*((1+(MID(Q$73,12,2))/100)^(P$72-$D$29)))","v":0}]
[null,null,"Resa 3",null,null,null,null,null,{"$f":"IF(OR($D$29=\"\",$D$30=\"\"),\"År saknas\",(($G76)*H76)*((1+(MID(I$73,12,2))/100)^(H$72-$D$29)))","v":0},null,{"$f":"IF(OR($D$29=\"\",$D$30=\"\"),\"År saknas\",(($G76)*J76)*((1+(MID(K$73,12,2))/100)^(J$72-$D$29)))","v":0},null,{"$f":"IF(OR($D$29=\"\",$D$30=\"\"),\"År saknas\",(($G76)*L76)*((1+(MID(M$73,12,2))/100)^(L$72-$D$29)))","v":0},null,{"$f":"IF(OR($D$29=\"\",$D$30=\"\"),\"År saknas\",(($G76)*N76)*((1+(MID(O$73,12,2))/100)^(N$72-$D$29)))","v":0},null,{"$f":"IF(OR($D$29=\"\",$D$30=\"\"),\"År saknas\",(($G76)*P76)*((1+(MID(Q$73,12,2))/100)^(P$72-$D$29)))","v":0}]
[]
[null,null,"Summa resekostnader",null,null,null,null,{"$f":"SUM(I$74:I76)","v":0},null,{"$f":"SUM(K$74:K76)","v":0},null,{"$f":"SUM(M$74:M76)","v":0},null,{"$f":"SUM(O$74:O76)","v":0},null,{"$f":"SUM(Q$74:Q76)","v":0}]
[]
[null,null,"B.1 Direkta driftkostnader (Lokal- och KI-interna kostnader kommer under övriga drifkostnader)",null,null,null,null,null,null,null,null,null,null,null,null,null,null,null,null,null,"Drifkostnader\nHit förs alla typer av driftkostnader som är direkt förknippade med projektet. Detta kan innefatta för projektet nödvändig litteratur, kemikalier, laboratorieutrustning, konsultkostnader, resor (inkl. brutto av eventuella skattepliktiga traktamenten).\n\nBeloppet anges som en total kostnad för projektet på respektive rad sedan anges förbrukning av resursen för respektive år som procent, 100% motsvarar alltså hela kostnaden för det året."]
[null,null,null,null,null,null,null,{"$f":"IF($D$30=\"\",\"\",IF($D$29>$D$30,\"Se fel i grundläggande uppgifter\",$D$30))","v":2025},null,{"$f":"IFERROR(H81+1,\"\")","v":2026},null,{"$f":"IFERROR(J81+1,\"\")","v":2027},null,{"$f":"IFERROR(L81+1,\"\")","v":2028},null,{"$f":"IFERROR(N81+1,\"\")","v":2029}]
[null,null,"Driftkostnader - beskrivning",null,null,null,"Kostnad att fördela ->","Förbr. %",{"$f":"IF($D$29=$D$30,\"inkl. index 0%\",\"inkl. index 1%\")","v":"inkl. index 0%"},"Förbr. %","inkl. index 1,0%","Förbr. %","inkl. index 1,0%","Förbr. %","inkl. index 1,0%","Förbr. %","inkl. index 1,0%"]
[null,null,"Instrument",null,null,null,null,null,{"$f":"IF(OR($D$29=\"\",$D$30=\"\"),\"År saknas\",(($G83)*H83)*((1+(MID(I$82,12,2))/100)^(H$81-$D$29)))","v":0},null,{"$f":"IF(OR($D$29=\"\",$D$30=\"\"),\"År saknas\",(($G83)*J83)*((1+(MID(K$82,12,2))/100)^(J$81-$D$29)))","v":0},null,{"$f":"IF(OR($D$29=\"\",$D$30=\"\"),\"År saknas\",(($G83)*L83)*((1+(MID(M$82,12,2))/100)^(L$81-$D$29)))","v":0},null,{"$f":"IF(OR($D$29=\"\",$D$30=\"\"),\"År saknas\",(($G83)*N83)*((1+(MID(O$82,12,2))/100)^(N$81-$D$29)))","v":0},null,{"$f":"IF(OR($D$29=\"\",$D$30=\"\"),\"År saknas\",(($G83)*P83)*((1+(MID(Q$82,12,2))/100)^(P$81-$D$29)))","v":0}]
[null,null,"Konsulttid",null,null,null,null,null,0,null,0,null,0,null,0,null,0]
[null,null,"Litteratur",null,null,null,null,null,0,null,0,null,0,null,0,null,0]
[null,null,"Djur",null,null,null,null,null,0,null,0,null,0,null,0,null,0]
[null,null,null,null,null,null,null,null,0,null,0,null,0,null,0,null,0]
[null,null,null,null,null,null,null,null,0,null,0,null,0,null,0,null,0]
[null,null,null,null,null,null,null,null,0,null,0,null,0,null,0,null,0]
[null,null,null,null,null,null,null,null,0,null,0,null,0,null,0,null,0]
[]
[null,null,"Summa Direkta driftkostnader",null,null,null,null,{"$f":"SUM(I$83:I90)","v":0},null,{"$f":"SUM(K$83:K90)","v":0},null,{"$f":"SUM(M$83:M90)","v":0},null,{"$f":"SUM(O$83:O90)","v":0},null,{"$f":"SUM(Q$83:Q90)","v":0}]
[]
[null,null,"B.2 Övriga driftkostnader (dessa exkluderas från INDI)",null,null,null,null,null,null,null,null,null,null,null,null,null,null,null,null,null,"Övriga driftkostnader\nAvskrivningar, Lokalkostnader och interna kostnader genererar ingen INDI i den mån kalkylen inkluderar detta.\n\nAnläggningar\nAnge den kvarvarande ekonomiska livslängden och investeringskostnaden (nettofakturabelopp) eller restvärde vid befintliga anläggningar. \nNyttjandegrad kan uppskattas eller beräknas genom att ta den totala tiden som anläggningen kommer nyttjas respektive år med den totala möjliga nyttjandetiden för anläggningen per år.\n\nLokalkostnader\nHit förs alla kostnader för de lokaler som nyttjas samt eventuella kostnader för städning och gemensamma ytor. Uppgifter om ytor och kostnd erhålls oftast från institutionens administration.\n\nInterna kostnader\nHit förs interna kostnader som uppstår av produkter eller tjänster som tillhandahålls från andra delar av KI, vilket ska inkludera motpartens indirekta kostnader (INDI)"]
[]
[null,null,null,null,null,null,null,{"$f":"IF($D$30=\"\",\"\",IF($D$29>$D$30,\"Se fel i grundläggande uppgifter\",$D$30))","v":2025},null,{"$f":"IFERROR(H96+1,\"\")","v":2026},null,{"$f":"IFERROR(J96+1,\"\")","v":2027},null,{"$f":"IFERROR(L96+1,\"\")","v":2028},null,{"$f":"IFERROR(N96+1,\"\")","v":2029}]
[null,null,"Anläggning - beskrivning",null,null,"Eko. livslängd","Investeringskostnad","Nyttj. %",{"$f":"IF($D$29=$D$30,\"inkl. index 0%\",\"inkl. index 0%\")","v":"inkl. index 0%"},"Nyttj. %","inkl. index 0%","Nyttj. %","inkl. index 0%","Nyttj. %","inkl. index 0%","Nyttj. %","inkl. index 0%"]
[null,null,"anl 1",null,null,null,null,null,{"$f":"IFERROR(IF((H$96-$D$30)>=((IF(LEN($F98)=4,LEFT($F98,1),LEFT($F98,2)))*1),\"*livslängd < proj-tid\",(($G98/(IF(LEN($F98)=4,LEFT($F98,1),LEFT($F98,2))))*H98)*((1+(MID(I$97,12,2))/100)^(H$96-$D$29))),0)","v":0},null,{"$f":"IFERROR(IF((J$96-$D$30)>=((IF(LEN($F98)=4,LEFT($F98,1),LEFT($F98,2)))*1),\"*livslängd < proj-tid\",(($G98/(IF(LEN($F98)=4,LEFT($F98,1),LEFT($F98,2))))*J98)*((1+(MID(K$97,12,2))/100)^(J$96-$D$29))),0)","v":0},null,{"$f":"IFERROR(IF((L$96-$D$30)>=((IF(LEN($F98)=4,LEFT($F98,1),LEFT($F98,2)))*1),\"*livslängd < proj-tid\",(($G98/(IF(LEN($F98)=4,LEFT($F98,1),LEFT($F98,2))))*L98)*((1+(MID(M$97,12,2))/100)^(L$96-$D$29))),0)","v":0},null,{"$f":"IFERROR(IF((N$96-$D$30)>=((IF(LEN($F98)=4,LEFT($F98,1),LEFT($F98,2)))*1),\"*livslängd < proj-tid\",(($G98/(IF(LEN($F98)=4,LEFT($F98,1),LEFT($F98,2))))*N98)*((1+(MID(O$97,12,2))/100)^(N$96-$D$29))),0)","v":0},null,{"$f":"IFERROR(IF((P$96-$D$30)>=((IF(LEN($F98)=4,LEFT($F98,1),LEFT($F98,2)))*1),\"*livslängd < proj-tid\",(($G98/(IF(LEN($F98)=4,LEFT($F98,1),LEFT($F98,2))))*P98)*((1+(MID(Q$97,12,2))/100)^(P$96-$D$29))),0)","v":0}]
[null,null,null,null,null,null,null,null,{"$f":"IFERROR(IF((H$96-$D$30)>=((IF(LEN($F99)=4,LEFT($F99,1),LEFT($F99,2)))*1),\"*livslängd < proj-tid\",(($G99/(IF(LEN($F99)=4,LEFT($F99,1),LEFT($F99,2))))*H99)*((1+(MID(I$97,12,2))/100)^(H$96-$D$29))),0)","v":0},null,{"$f":"IFERROR(IF((J$96-$D$30)>=((IF(LEN($F99)=4,LEFT($F99,1),LEFT($F99,2)))*1),\"*livslängd < proj-tid\",(($G99/(IF(LEN($F99)=4,LEFT($F99,1),LEFT($F99,2))))*J99)*((1+(MID(K$97,12,2))/100)^(J$96-$D$29))),0)","v":0},null,{"$f":"IFERROR(IF((L$96-$D$30)>=((IF(LEN($F99)=4,LEFT($F99,1),LEFT($F99,2)))*1),\"*livslängd < proj-tid\",(($G99/(IF(LEN($F99)=4,LEFT($F99,1),LEFT($F99,2))))*L99)*((1+(MID(M$97,12,2))/100)^(L$96-$D$29))),0)","v":0},null,{"$f":"IFERROR(IF((N$96-$D$30)>=((IF(LEN($F99)=4,LEFT($F99,1),LEFT($F99,2)))*1),\"*livslängd < proj-tid\",(($G99/(IF(LEN($F99)=4,LEFT($F99,1),LEFT($F99,2))))*N99)*((1+(MID(O$97,12,2))/100)^(N$96-$D$29))),0)","v":0},null,{"$f":"IFERROR(IF((P$96-$D$30)>=((IF(LEN($F99)=4,LEFT($F99,1),LEFT($F99,2)))*1),\"*livslängd < proj-tid\",(($G99/(IF(LEN($F99)=4,LEFT($F99,1),LEFT($F99,2))))*P99)*((1+(MID(Q$97,12,2))/100)^(P$96-$D$29))),0)","v":0}]
[]
[null,null,null,null,null,null,null,{"$f":"IF($D$30=\"\",\"\",IF($D$29>$D$30,\"Se fel i grundläggande uppgifter\",$D$30))","v":2025},null,{"$f":"IFERROR(H101+1,\"\")","v":2026},null,{"$f":"IFERROR(J101+1,\"\")","v":2027},null,{"$f":"IFERROR(L101+1,\"\")","v":2028},null,{"$f":"IFERROR(N101+1,\"\")","v":2029}]
[null,null,"Lokalkostnader - beskrivning",null,null,"Lokal yta kvm","Kvm kostnad / år","Nyttj. %",{"$f":"IF($D$29=$D$30,\"inkl. index 0%\",\"inkl. index 1%\")","v":"inkl. index 0%"},"Nyttj. %","inkl. index 1%","Nyttj. %","inkl. index 1%","Nyttj. %","inkl. index 1%","Nyttj. %","inkl. index 1%"]
[null,null,"Kontor1",null,null,null,null,null,{"$f":"IF(OR($D$29=\"\",$D$30=\"\"),\"År saknas\",(($F103*$G103)*H103)*((1+(MID(I$102,12,2))/100)^(H$101-$D$29)))","v":0},null,{"$f":"IF(OR($D$29=\"\",$D$30=\"\"),\"År saknas\",(($F103*$G103)*J103)*((1+(MID(K$102,12,2))/100)^(J$101-$D$29)))","v":0},null,{"$f":"IF(OR($D$29=\"\",$D$30=\"\"),\"År saknas\",(($F103*$G103)*L103)*((1+(MID(M$102,12,2))/100)^(L$101-$D$29)))","v":0},null,{"$f":"IF(OR($D$29=\"\",$D$30=\"\"),\"År saknas\",(($F103*$G103)*N103)*((1+(MID(O$102,12,2))/100)^(N$101-$D$29)))","v":0},null,{"$f":"IF(OR($D$29=\"\",$D$30=\"\"),\"År saknas\",(($F103*$G103)*P103)*((1+(MID(Q$102,12,2))/100)^(P$101-$D$29)))","v":0}]
[null,null,"Lab1",null,null,null,null,null,{"$f":"IF(OR($D$29=\"\",$D$30=\"\"),\"År saknas\",(($F104*$G104)*H104)*((1+(MID(I$102,12,2))/100)^(H$101-$D$29)))","v":0},null,{"$f":"IF(OR($D$29=\"\",$D$30=\"\"),\"År saknas\",(($F104*$G104)*J104)*((1+(MID(K$102,12,2))/100)^(J$101-$D$29)))","v":0},null,{"$f":"IF(OR($D$29=\"\",$D$30=\"\"),\"År saknas\",(($F104*$G104)*L104)*((1+(MID(M$102,12,2))/100)^(L$101-$D$29)))","v":0},null,{"$f":"IF(OR($D$29=\"\",$D$30=\"\"),\"År saknas\",(($F104*$G104)*N104)*((1+(MID(O$102,12,2))/100)^(N$101-$D$29)))","v":0},null,{"$f":"IF(OR($D$29=\"\",$D$30=\"\"),\"År saknas\",(($F104*$G104)*P104)*((1+(MID(Q$102,12,2))/100)^(P$101-$D$29)))","v":0}]
[null,null,null,null,null,null,null,null,{"$f":"IF(OR($D$29=\"\",$D$30=\"\"),\"År saknas\",(($F105*$G105)*H105)*((1+(MID(I$102,12,2))/100)^(H$101-$D$29)))","v":0},null,{"$f":"IF(OR($D$29=\"\",$D$30=\"\"),\"År saknas\",(($F105*$G105)*J105)*((1+(MID(K$102,12,2))/100)^(J$101-$D$29)))","v":0},null,{"$f":"IF(OR($D$29=\"\",$D$30=\"\"),\"År saknas\",(($F105*$G105)*L105)*((1+(MID(M$102,12,2))/100)^(L$101-$D$29)))","v":0},null,{"$f":"IF(OR($D$29=\"\",$D$30=\"\"),\"År saknas\",(($F105*$G105)*N105)*((1+(MID(O$102,12,2))/100)^(N$101-$D$29)))","v":0},null,{"$f":"IF(OR($D$29=\"\",$D$30=\"\"),\"År saknas\",(($F105*$G105)*P105)*((1+(MID(Q$102,12,2))/100)^(P$101-$D$29)))","v":0}]
[]
[null,null,null,null,null,null,null,{"$f":"IF($D$30=\"\",\"\",IF($D$29>$D$30,\"Se fel i grundläggande uppgifter\",$D$30))","v":2025},null,{"$f":"IFERROR(H107+1,\"\")","v":2026},null,{"$f":"IFERROR(J107+1,\"\")","v":2027},null,{"$f":"IFERROR(L107+1,\"\")","v":2028},null,{"$f":"IFERROR(N107+1,\"\")","v":2029}]
[null,null,"Interna kostnader och eventuell INDI-befriad verksamhet - beskrivning",null,null,null,"Kostnad att fördela ->","Förbr. %",{"$f":"IF($D$29=$D$30,\"inkl. index 0%\",\"inkl. index 0%\")","v":"inkl. index 0%"},"Förbr. %","inkl. index 0%","Förbr. %","inkl. index 0%","Förbr. %","inkl. index 0%","Förbr. %","inkl. index 0%"]
[null,null,"Interntjänst1, inkl. motpartens INDI",null,null,null,null,null,{"$f":"IF(OR($D$29=\"\",$D$30=\"\"),\"År saknas\",(($G109)*H109)*((1+(MID(I$108,12,2))/100)^(H$107-$D$29)))","v":0},null,{"$f":"IF(OR($D$29=\"\",$D$30=\"\"),\"År saknas\",(($G109)*J109)*((1+(MID(K$108,12,2))/100)^(J$107-$D$29)))","v":0},null,{"$f":"IF(OR($D$29=\"\",$D$30=\"\"),\"År saknas\",(($G109)*L109)*((1+(MID(M$108,12,2))/100)^(L$107-$D$29)))","v":0},null,{"$f":"IF(OR($D$29=\"\",$D$30=\"\"),\"År saknas\",(($G109)*N109)*((1+(MID(O$108,12,2))/100)^(N$107-$D$29)))","v":0},null,{"$f":"IF(OR($D$29=\"\",$D$30=\"\"),\"År saknas\",(($G109)*P109)*((1+(MID(Q$108,12,2))/100)^(P$107-$D$29)))","v":0}]
[null,null,"IT avgift 10 400 kr per anställd/anknuten och år (2022)",null,null,null,null,null,{"$f":"IF(OR($D$29=\"\",$D$30=\"\"),\"År saknas\",(($G110)*H110)*((1+(MID(I$108,12,2))/100)^(H$107-$D$29)))","v":0},null,{"$f":"IF(OR($D$29=\"\",$D$30=\"\"),\"År saknas\",(($G110)*J110)*((1+(MID(K$108,12,2))/100)^(J$107-$D$29)))","v":0},null,{"$f":"IF(OR($D$29=\"\",$D$30=\"\"),\"År saknas\",(($G110)*L110)*((1+(MID(M$108,12,2))/100)^(L$107-$D$29)))","v":0},null,{"$f":"IF(OR($D$29=\"\",$D$30=\"\"),\"År saknas\",(($G110)*N110)*((1+(MID(O$108,12,2))/100)^(N$107-$D$29)))","v":0},null,{"$f":"IF(OR($D$29=\"\",$D$30=\"\"),\"År saknas\",(($G110)*P110)*((1+(MID(Q$108,12,2))/100)^(P$107-$D$29)))","v":0}]
[null,null,null,null,null,null,null,null,{"$f":"IF(OR($D$29=\"\",$D$30=\"\"),\"År saknas\",(($G111)*H111)*((1+(MID(I$108,12,2))/100)^(H$107-$D$29)))","v":0},null,{"$f":"IF(OR($D$29=\"\",$D$30=\"\"),\"År saknas\",(($G111)*J111)*((1+(MID(K$108,12,2))/100)^(J$107-$D$29)))","v":0},null,{"$f":"IF(OR($D$29=\"\",$D$30=\"\"),\"År saknas\",(($G111)*L111)*((1+(MID(M$108,12,2))/100)^(L$107-$D$29)))","v":0},null,{"$f":"IF(OR($D$29=\"\",$D$30=\"\"),\"År saknas\",(($G111)*N111)*((1+(MID(O$108,12,2))/100)^(N$107-$D$29)))","v":0},null,{"$f":"IF(OR($D$29=\"\",$D$30=\"\"),\"År saknas\",(($G111)*P111)*((1+(MID(Q$108,12,2))/100)^(P$107-$D$29)))","v":0}]
[]
[null,null,"Summa Övriga kostnader",null,null,null,null,{"$f":"SUM(I$98:I99)+SUM(I$109:I111)+SUM(I$103:I105)","v":0},null,{"$f":"SUM(K$98:K99)+SUM(K$109:K111)+SUM(K$103:K105)","v":0},null,{"$f":"SUM(M$98:M99)+SUM(M$109:M111)+SUM(M$103:M105)","v":0},null,{"$f":"SUM(O$98:O99)+SUM(O$109:O111)+SUM(O$103:O105)","v":0},null,{"$f":"SUM(Q$98:Q99)+SUM(Q$109:Q111)+SUM(Q$103:Q105)","v":0}]
[]
[null,null,"Summa Driftkostnader",null,null,null,null,{"$f":"H113+H92+H78","v":0},null,{"$f":"J113+J92+J78","v":0},null,{"$f":"L113+L92+L78","v":0},null,{"$f":"N113+N92+N78","v":0},null,{"$f":"P113+P92+P78","v":0}]
[null,null,null,null,null,null,null,null,null,null,null,null,null,null,null,null,null,null,null,null,"Gemensamma kostnader\nIndirekta kostnader (INDI)\nDessa innefattar oftast universitets- och fakultetsgemensamma kostnader samt institutionsgemensamma kostnader.\n\nHär finns även möjlighet att göra ned- eller uppräkning av INDI (kan nyttjas vid flerårigt projekt)."]
[null,null,"C. Gemensamma kostnader"]
[]
[null,null,{"$f":"IF(LEFT($D$28,2)=\"UF\",$D$28,\"Universitetsgem.\")","v":"Universitetsgem."},null,null,null,{"$f":"IF($D$28=\"\",0,IF(LEFT($D$28,2)=\"UF\",VLOOKUP($C$141,'INDI FO 2025'!$C:$G,5,0),VLOOKUP(LEFT($D$28,2),'INDI FO 2025'!$A:$G,6,0)))","v":0}]
[null,null,{"$f":"IF(LEFT($D$28,2)=\"UF\",\"\",\"Institutionsgem.\")","v":"Institutionsgem."},null,null,null,{"$f":"IF($D$28=\"\",0,IF(LEFT($D$28,2)=\"UF\",\"\",VLOOKUP(LEFT($D$28,2),'INDI FO 2025'!$A:$G,4,0)))","v":0}]
[null,null,"Ned- / Uppräkning av INDI",null,null,null,0]
[null,null,null,null,null,null,{"$f":"SUM(G119:G121)","v":0}]
[]
[null,null,"Summa Indirekta kostnader",null,null,null,null,{"$f":"((H92+H65+H78)*$G122)","v":0},null,{"$f":"((J92+J65+J78)*$G122)","v":0},null,{"$f":"((L92+L65+L78)*$G122)","v":0},null,{"$f":"((N92+N65+N78)*$G122)","v":0},null,{"$f":"((P92+P65+P78)*$G122)","v":0}]
[]
[null,null,"D. Riskpåslag"]
[null,null,null,null,null,null,null,null,null,null,null,null,null,null,null,null,null,null,null,null,"Riskpåslag/Säkerhetsmarginal\nRiskpåslag kan nyttjas när det finns väsentliga osäkerheter kopplade till uppskattning av kostnaderna. Rekommenderat riskpåslag är 3% på uppdrag, dock ska hänsyn tas till historiks utveckling inom verksamheten."]
[null,null,"Riskpåslag/Säkerhetsmarginal",null,null,null,0]
[]
[]
[null,null,"SUMMA PROJEKTKOSTNADER",null,null,null,null,{"$f":"(H65+H115+H124)*(1+$G128)","v":0},null,{"$f":"(J65+J115+J124)*(1+$G128)","v":0},null,{"$f":"(L65+L115+L124)*(1+$G128)","v":0},null,{"$f":"(N65+N115+N124)*(1+$G128)","v":0},null,{"$f":"(P65+P115+P124)*(1+$G128)","v":0}]
[]
[]
[null,null,"KOSTNADSSPECIFIKATION",null,null,null,null,null,null,null,null,null,null,null,null,null,null,null,null,null,"\nKostnadsspecifikation\nHär redogörs de totala förväntade kostnaderna för projektet och som är underlag för prissättning.\n\nSumma exklusive moms debiteras internt och från statliga myndigheter samt utlandet i de flesta fall, och summa inklusive moms debiteras övriga organisationer och företag. Välj externt uppdrag i grundläggande uppgifter vid behov av moms och internt, statligt eller övrigt utan moms då moms inte ska debiteras.\n\n\n\n\n\nUnderskrifter\nOm nettoomsättnming överskrider 100 000 kr är godkännande från Universitetsdirektören obligatorisk för uppdrag."]
[]
[null,null,"Timkostnad (personalkostnad exklusive indirekta kostnader)",null,null,{"$f":"IFERROR(F59&\"h á \"&(ROUND(((SUM($H65:Q65)+SUM($H124:Q124))/$F59)*(1+$G128),0)&\"kr\"),\"\")","v":"3600h á 0kr"},{"$f":"(ROUND((SUM($H65:Q65)),0)*(1+$G128))","v":0}]
[null,null,"Indirekt kostnad",null,null,null,{"$f":"H124","v":0}]
[null,null,"Driftkostnad",null,null,null,{"$f":"ROUND(SUM($H115:Q115),0)*(1+$G128)","v":0}]
[]
[null,null,"SUMMA KOSTNADER (EXKL MOMS)",null,null,null,{"$f":"(SUM($H65:Q65)+SUM($H113:Q113)+SUM($H124:Q124)+SUM($H92:Q92))*(1+$G128)","v":0}]
[]
[null,null,{"$f":"IF(G142=\"\",\"Moms redogörs här vid externa uppdrag\",\"VARAV MOMS\")","v":"VARAV MOMS"},null,null,null,{"$f":"IF(G143=\"\",\"\",G143-G140)","v":0}]
[null,null,{"$f":"IF(G143=\"\",\"Internt, statligt och oftast utländska uppdrag debiteras exkl moms\",\"SUMMA KOSTNADER (INKL 25% MOMS)\")","v":"SUMMA KOSTNADER (INKL 25% MOMS)"},null,null,null,{"$f":"IF(OR($D$28=\"UF - Internt\",$D$33=\"Internt\",$D$33=\"Statligt\",$D$33=\"Övr. utan moms\",),\"\",G140*1.25)","v":0}]
[]
[]
[null,null,"Projektledare/-ansvarig",null,"Kontrollerad av inst.-ekonom / motsvarande",null,"Prefekt / med motsvarande beslutsrätt",null,null," "]
[]
[null,null,null,null,null,null,null,null,null," "]
[null,null,"Signatur",null,"Signatur",null,"Signatur",null,null," "]
[]
[]
[null,null,"Namnförtydligande",null,"Namnförtydligande",null,"Namnförtydligande",null,null," "]
[]
[]
[null,null,null,null,null,null,null,null,null,null,null,null,null,null,null,null,null,null,null,null,"\nBeräkning av debiterbar månadsersättning och tid (exkl. LKP)\n\nI den mån det är ett externt uppdrag ska avärkning göras för indirekt tid eller produktionsbortfall såsom egen- administration, utbildning och utvecklingsarbete ske.\n\nDet som är individuellt och kan ändras i kalkylen är:\n- månadslön (här anger individens bruttomånadslön exkl. LKP) \n- antalet semesterdagar som individen har (ex. 7 veckor är 35 dagar)\n- övrig betald ledighet i dagar (ex. avtalad friskvårdstimmar eller liknande)\n\nI den mån projektet är ett externt uppdrag ska även hänsyn tas till övrig ineffektiv betald arbetstid (produktionsbortfall) som kan vara:\n- egen administration som inte är förknippad med något projekt\n- egen utveckling, så som utbildningar och annat\n- generella resor och arrangemang som är personalhälsofrämjande\n"]
[null,null,"BERÄKNING AV DEBITERBAR  MÅNADSERSÄTTNING OCH TID (Exkl. LKP)"]
[]
[null,null,"Ange månadslön (hela kronor):"]
[]
[null,null,"Arbetstid på årsbas","Dagar","Timmar totalt"]
[null,null,"52 veckor x 40 tim (heltid)",260,{"$f":"52*40","v":2080}]
[null,null,"- 2 veckor helgdagar avgår",10,{"$f":"2*40","v":80}]
[null,null,"Betald tid",{"$f":"D161-D162","v":250},{"$f":"E161-E162","v":2000}]
[null,null,"- betalda semesterdagar",35,{"$f":"D164*8","v":280}]
[null,null,"- övrig betald frånvaro",5,{"$f":"D165*8","v":40}]
[null,null,"STANDARDTID",{"$f":"D163-D164-D165","v":210},{"$f":"E163-E164-E165","v":1680}]
[null,null,"- egen administration",10,{"$f":"D167*8","v":80}]
[null,null,"- egen utveckling etc",25,{"$f":"D168*8","v":200}]
[null,null,"- resor, sammankomster",25,{"$f":"D169*8","v":200}]
[null,null,"Summa indirekt tid",{"$f":"SUM(D167:D169)","v":60},{"$f":"SUM(E167:E169)","v":480}]
[null,null,"DEBITERBAR TID (DIREKT TID)",{"$f":"D166-D170","v":150},{"$f":"E166-E170","v":1200}]
[]
[null,null,{"$f":"IF(G173=0,\"Ange månadslön\",\"Månadsersättning exkl. LKP Interna uppdrag:\")","v":"Ange månadslön"},null,{"$f":"E158/E171*E171","v":0},"kr per månad",{"$f":"ROUND(E158/(E166/12),2)","v":0},"kr/tim"]
[]
[null,null,{"$f":"IF(G175=0,\"Ange månadslön\",\"Månadsersättning exkl. LKP Externa uppdrag:\")","v":"Ange månadslön"},null,{"$f":"E158/E171*E166","v":0},"kr per månad",{"$f":"ROUND(E158/(E171/12),2)","v":0},"kr/tim"]

{"sheet":"Inläsning Planner uppdrag","index":2,"n_rows":65,"n_cols":10,"rows_kept":65,"cut":false,"hidden":true,"merged":[[2,1,7,10]]}
[null,"UPPDRAGSFORSKNING - STÖD FÖR BUDGET TILL UBW"]
[]
[null,"Inledning\n\nDenna flik summerar kostnader och intäkter som fyllts in i kalkylfliken och återvisar dem i en budget modell som kan enkelt föras in i UBWs Saldo tabell för uppföljningsändamål. Posterna hämtas till olika konton beroende på vad som fyllts i under respektive rubrik i kalkylen. \n\nDet är möjligt att välja antingen att föra in totala förväntad utfall på första året, det under första rubriken nedan, eller en årsfördelad from första året och framåt som finns under rubriken årsfördelad budget.\n\nOBS! Kopiera endast gråa fält och klistra in direkt i UBW (Ctrl + C & Ctrl + V). Se gärna UBW handbok på medarbetarportalen för ytterligare instruktioner om hur funktionen nyttjas."]
[]
[]
[]
[]
[]
[]
[]
[null,null,"TOTAL BUDGET"]
[]
[null,null,"RR2","Beskrivning","Konto","Proj","Per från","Per till","Budget (BB)","Text"]
[null,null,11,"Intäkter avgifter",3313,{"$f":"IF(Uppdragsforskning!$D$36=\"\",\"Ange projektnummer\",Uppdragsforskning!$D$36)","v":"Ange projektnummer"},{"$f":"IF(OR(Uppdragsforskning!$D$30=\"\",Uppdragsforskning!$E$30=\"\"),\"Ange start år/månad\",Uppdragsforskning!$D$30&Uppdragsforskning!$E$30)","v":"202501"},{"$f":"IF(OR(Uppdragsforskning!$D$31=\"\",Uppdragsforskning!$E$31=\"\"),\"Ange slut år/månad\",Uppdragsforskning!$D$31&Uppdragsforskning!$E$31)","v":"Ange slut år/månad"},{"$f":"I26+I34+I42+I50+I58","v":0},{"$f":"\"Budget totalt \"&Uppdragsforskning!$D$36&\"\"","v":"Budget totalt "}]
[null,null,21,"Personalkostnader",4011,{"$f":"IF(Uppdragsforskning!$D$36=\"\",\"Ange projektnummer\",Uppdragsforskning!$D$36)","v":"Ange projektnummer"},{"$f":"IF(OR(Uppdragsforskning!$D$30=\"\",Uppdragsforskning!$E$30=\"\"),\"Ange start år/månad\",Uppdragsforskning!$D$30&Uppdragsforskning!$E$30)","v":"202501"},{"$f":"IF(OR(Uppdragsforskning!$D$31=\"\",Uppdragsforskning!$E$31=\"\"),\"Ange slut år/månad\",Uppdragsforskning!$D$31&Uppdragsforskning!$E$31)","v":"Ange slut år/månad"},{"$f":"I27+I35+I43+I51+I59","v":0},{"$f":"\"Budget totalt \"&Uppdragsforskning!$D$36&\"\"","v":"Budget totalt "}]
[null,null,211,"Gemensamma kostnader (INDI)",49988,{"$f":"IF(Uppdragsforskning!$D$36=\"\",\"Ange projektnummer\",Uppdragsforskning!$D$36)","v":"Ange projektnummer"},{"$f":"IF(OR(Uppdragsforskning!$D$30=\"\",Uppdragsforskning!$E$30=\"\"),\"Ange start år/månad\",Uppdragsforskning!$D$30&Uppdragsforskning!$E$30)","v":"202501"},{"$f":"IF(OR(Uppdragsforskning!$D$31=\"\",Uppdragsforskning!$E$31=\"\"),\"Ange slut år/månad\",Uppdragsforskning!$D$31&Uppdragsforskning!$E$31)","v":"Ange slut år/månad"},{"$f":"I28+I36+I44+I52+I60","v":0},{"$f":"\"Budget totalt \"&Uppdragsforskning!$D$36&\"\"","v":"Budget totalt "}]
[null,null,22,"Lokalkostnader",50111,{"$f":"IF(Uppdragsforskning!$D$36=\"\",\"Ange projektnummer\",Uppdragsforskning!$D$36)","v":"Ange projektnummer"},{"$f":"IF(OR(Uppdragsforskning!$D$30=\"\",Uppdragsforskning!$E$30=\"\"),\"Ange start år/månad\",Uppdragsforskning!$D$30&Uppdragsforskning!$E$30)","v":"202501"},{"$f":"IF(OR(Uppdragsforskning!$D$31=\"\",Uppdragsforskning!$E$31=\"\"),\"Ange slut år/månad\",Uppdragsforskning!$D$31&Uppdragsforskning!$E$31)","v":"Ange slut år/månad"},{"$f":"I29+I37+I45+I53+I61","v":0},{"$f":"\"Budget totalt \"&Uppdragsforskning!$D$36&\"\"","v":"Budget totalt "}]
[null,null,23,"Resekostnader",5522,{"$f":"IF(Uppdragsforskning!$D$36=\"\",\"Ange projektnummer\",Uppdragsforskning!$D$36)","v":"Ange projektnummer"},{"$f":"IF(OR(Uppdragsforskning!$D$30=\"\",Uppdragsforskning!$E$30=\"\"),\"Ange start år/månad\",Uppdragsforskning!$D$30&Uppdragsforskning!$E$30)","v":"202501"},{"$f":"IF(OR(Uppdragsforskning!$D$31=\"\",Uppdragsforskning!$E$31=\"\"),\"Ange slut år/månad\",Uppdragsforskning!$D$31&Uppdragsforskning!$E$31)","v":"Ange slut år/månad"},{"$f":"Uppdragsforskning!H78+Uppdragsforskning!J78+Uppdragsforskning!L78+Uppdragsforskning!N78+Uppdragsforskning!P78","v":0},{"$f":"\"Budget totalt \"&Uppdragsforskning!$D$36&\"\"","v":"Budget totalt "}]
[null,null,23,"Övriga driftskostnader",5797,{"$f":"IF(Uppdragsforskning!$D$36=\"\",\"Ange projektnummer\",Uppdragsforskning!$D$36)","v":"Ange projektnummer"},{"$f":"IF(OR(Uppdragsforskning!$D$30=\"\",Uppdragsforskning!$E$30=\"\"),\"Ange start år/månad\",Uppdragsforskning!$D$30&Uppdragsforskning!$E$30)","v":"202501"},{"$f":"IF(OR(Uppdragsforskning!$D$31=\"\",Uppdragsforskning!$E$31=\"\"),\"Ange slut år/månad\",Uppdragsforskning!$D$31&Uppdragsforskning!$E$31)","v":"Ange slut år/månad"},{"$f":"I31+I39+I47+I55+I63","v":0},{"$f":"\"Budget totalt \"&Uppdragsforskning!$D$36&\"\"","v":"Budget totalt "}]
[null,null,23,"Interna kostnader",57849,{"$f":"IF(Uppdragsforskning!$D$36=\"\",\"Ange projektnummer\",Uppdragsforskning!$D$36)","v":"Ange projektnummer"},{"$f":"IF(OR(Uppdragsforskning!$D$30=\"\",Uppdragsforskning!$E$30=\"\"),\"Ange start år/månad\",Uppdragsforskning!$D$30&Uppdragsforskning!$E$30)","v":"202501"},{"$f":"IF(OR(Uppdragsforskning!$D$31=\"\",Uppdragsforskning!$E$31=\"\"),\"Ange slut år/månad\",Uppdragsforskning!$D$31&Uppdragsforskning!$E$31)","v":"Ange slut år/månad"},{"$f":"I32+I40+I48+I56+I64","v":0},{"$f":"\"Budget totalt \"&Uppdragsforskning!$D$36&\"\"","v":"Budget totalt "}]
[null,null,24,"Avskrivningar",6911,{"$f":"IF(Uppdragsforskning!$D$36=\"\",\"Ange projektnummer\",Uppdragsforskning!$D$36)","v":"Ange projektnummer"},{"$f":"IF(OR(Uppdragsforskning!$D$30=\"\",Uppdragsforskning!$E$30=\"\"),\"Ange start år/månad\",Uppdragsforskning!$D$30&Uppdragsforskning!$E$30)","v":"202501"},{"$f":"IF(OR(Uppdragsforskning!$D$31=\"\",Uppdragsforskning!$E$31=\"\"),\"Ange slut år/månad\",Uppdragsforskning!$D$31&Uppdragsforskning!$E$31)","v":"Ange slut år/månad"},{"$f":"I33+I41+I49+I57+I65","v":0},{"$f":"\"Budget totalt \"&Uppdragsforskning!$D$36&\"\"","v":"Budget totalt "}]
[]
[null,null,"ÅRSFÖRDELAD BUDGET"]
[]
[null,null,"RR2","Beskrivning","Konto","Proj","Per från","Per till","Budget (BB)","Text"]
[null,null,11,"Intäkter av avgifter",3313,{"$f":"IF(Uppdragsforskning!$D$36=\"\",\"Ange projektnummer\",Uppdragsforskning!$D$36)","v":"Ange projektnummer"},{"$f":"RIGHT(J26,4)&Uppdragsforskning!$E$30","v":"202501"},{"$f":"IFERROR(IF(_xlfn.NUMBERVALUE(RIGHT(J26,4))=Uppdragsforskning!$D$31,RIGHT(J26,4)&Uppdragsforskning!$E$31,RIGHT(J26,4)&\"12\"),\"Ange start/slut år/mån\")","v":"202512"},{"$f":"SUM(Uppdragsforskning!H131:I131)*-1","v":0},{"$f":"\"Budget \"&Uppdragsforskning!$D$36&\" \"&Uppdragsforskning!H$43","v":"Budget  2025"}]
[null,null,21,"Personalkostnader",4011,{"$f":"IF(Uppdragsforskning!$D$36=\"\",\"Ange projektnummer\",Uppdragsforskning!$D$36)","v":"Ange projektnummer"},{"$f":"RIGHT(J27,4)&Uppdragsforskning!$E$30","v":"202501"},{"$f":"IFERROR(IF(_xlfn.NUMBERVALUE(RIGHT(J27,4))=Uppdragsforskning!$D$31,RIGHT(J27,4)&Uppdragsforskning!$E$31,RIGHT(J27,4)&\"12\"),\"Ange start/slut år/mån\")","v":"202512"},{"$f":"SUM(Uppdragsforskning!H65:I65)","v":0},{"$f":"\"Budget \"&Uppdragsforskning!$D$36&\" \"&Uppdragsforskning!H$43","v":"Budget  2025"}]
[null,null,211,"Gemensamma kostnader (INDI)",49988,{"$f":"IF(Uppdragsforskning!$D$36=\"\",\"Ange projektnummer\",Uppdragsforskning!$D$36)","v":"Ange projektnummer"},{"$f":"RIGHT(J28,4)&Uppdragsforskning!$E$30","v":"202501"},{"$f":"IFERROR(IF(_xlfn.NUMBERVALUE(RIGHT(J28,4))=Uppdragsforskning!$D$31,RIGHT(J28,4)&Uppdragsforskning!$E$31,RIGHT(J28,4)&\"12\"),\"Ange start/slut år/mån\")","v":"202512"},{"$f":"SUM(Uppdragsforskning!H124:I124)","v":0},{"$f":"\"Budget \"&Uppdragsforskning!$D$36&\" \"&Uppdragsforskning!H$43","v":"Budget  2025"}]
[null,null,22,"Lokalkostnader",50111,{"$f":"IF(Uppdragsforskning!$D$36=\"\",\"Ange projektnummer\",Uppdragsforskning!$D$36)","v":"Ange projektnummer"},{"$f":"RIGHT(J29,4)&Uppdragsforskning!$E$30","v":"202501"},{"$f":"IFERROR(IF(_xlfn.NUMBERVALUE(RIGHT(J29,4))=Uppdragsforskning!$D$31,RIGHT(J29,4)&Uppdragsforskning!$E$31,RIGHT(J29,4)&\"12\"),\"Ange start/slut år/mån\")","v":"202512"},{"$f":"SUM(Uppdragsforskning!I$103:I105)","v":0},{"$f":"\"Budget \"&Uppdragsforskning!$D$36&\" \"&Uppdragsforskning!H$43","v":"Budget  2025"}]
[null,null,23,"Resekostnader",5522,{"$f":"IF(Uppdragsforskning!$D$36=\"\",\"Ange projektnummer\",Uppdragsforskning!$D$36)","v":"Ange projektnummer"},{"$f":"RIGHT(J30,4)&Uppdragsforskning!$E$30","v":"202501"},{"$f":"IFERROR(IF(_xlfn.NUMBERVALUE(RIGHT(J30,4))=Uppdragsforskning!$D$31,RIGHT(J30,4)&Uppdragsforskning!$E$31,RIGHT(J30,4)&\"12\"),\"Ange start/slut år/mån\")","v":"202512"},{"$f":"SUM(Uppdragsforskning!I$74:I76)","v":0},{"$f":"\"Budget \"&Uppdragsforskning!$D$36&\" \"&Uppdragsforskning!H$43","v":"Budget  2025"}]
[null,null,23,"Övriga driftskostnader",5797,{"$f":"IF(Uppdragsforskning!$D$36=\"\",\"Ange projektnummer\",Uppdragsforskning!$D$36)","v":"Ange projektnummer"},{"$f":"RIGHT(J31,4)&Uppdragsforskning!$E$30","v":"202501"},{"$f":"IFERROR(IF(_xlfn.NUMBERVALUE(RIGHT(J31,4))=Uppdragsforskning!$D$31,RIGHT(J31,4)&Uppdragsforskning!$E$31,RIGHT(J31,4)&\"12\"),\"Ange start/slut år/mån\")","v":"202512"},{"$f":"SUM(Uppdragsforskning!H92:I92)","v":0},{"$f":"\"Budget \"&Uppdragsforskning!$D$36&\" \"&Uppdragsforskning!H$43","v":"Budget  2025"}]
[null,null,23,"Interna kostnader",57849,{"$f":"IF(Uppdragsforskning!$D$36=\"\",\"Ange projektnummer\",Uppdragsforskning!$D$36)","v":"Ange projektnummer"},{"$f":"RIGHT(J32,4)&Uppdragsforskning!$E$30","v":"202501"},{"$f":"IFERROR(IF(_xlfn.NUMBERVALUE(RIGHT(J32,4))=Uppdragsforskning!$D$31,RIGHT(J32,4)&Uppdragsforskning!$E$31,RIGHT(J32,4)&\"12\"),\"Ange start/slut år/mån\")","v":"202512"},{"$f":"SUM(Uppdragsforskning!I$109:I111)","v":0},{"$f":"\"Budget \"&Uppdragsforskning!$D$36&\" \"&Uppdragsforskning!H$43","v":"Budget  2025"}]
[null,null,24,"Avskrivningar",6911,{"$f":"IF(Uppdragsforskning!$D$36=\"\",\"Ange projektnummer\",Uppdragsforskning!$D$36)","v":"Ange projektnummer"},{"$f":"RIGHT(J33,4)&Uppdragsforskning!$E$30","v":"202501"},{"$f":"IFERROR(IF(_xlfn.NUMBERVALUE(RIGHT(J33,4))=Uppdragsforskning!$D$31,RIGHT(J33,4)&Uppdragsforskning!$E$31,RIGHT(J33,4)&\"12\"),\"Ange start/slut år/mån\")","v":"202512"},{"$f":"SUM(Uppdragsforskning!I$98:I99)","v":0},{"$f":"\"Budget \"&Uppdragsforskning!$D$36&\" \"&Uppdragsforskning!H$43","v":"Budget  2025"}]
[null,null,11,"Intäkter av avgifter",3313,{"$f":"Uppdragsforskning!$D$36","v":0},{"$f":"RIGHT(J34,4)&\"01\"","v":"01"},{"$f":"IF(_xlfn.NUMBERVALUE(RIGHT(J34,4))=Uppdragsforskning!$D$31,RIGHT(J34,4)&Uppdragsforskning!$E$31,RIGHT(J34,4)&\"12\")","v":"12"},{"$f":"SUM(Uppdragsforskning!J131:K131)*-1","v":0},{"$f":"IF(Uppdragsforskning!$D$36=\"\",\"\",IF(Uppdragsforskning!$D$31<=Uppdragsforskning!$D$30+1,\"\",\"Budget \"&Uppdragsforskning!$D$36&\" \"&Uppdragsforskning!J$43))","v":""}]
[null,null,21,"Personalkostnader",4011,{"$f":"Uppdragsforskning!$D$36","v":0},{"$f":"RIGHT(J35,4)&\"01\"","v":"01"},{"$f":"IF(_xlfn.NUMBERVALUE(RIGHT(J35,4))=Uppdragsforskning!$D$31,RIGHT(J35,4)&Uppdragsforskning!$E$31,RIGHT(J35,4)&\"12\")","v":"12"},{"$f":"SUM(Uppdragsforskning!J65:K65)","v":0},{"$f":"IF(Uppdragsforskning!$D$36=\"\",\"\",IF(Uppdragsforskning!$D$31<Uppdragsforskning!$D$30+1,\"\",\"Budget \"&Uppdragsforskning!$D$36&\" \"&Uppdragsforskning!J$43))","v":""}]
[null,null,211,"Gemensamma kostnader (INDI)",49988,{"$f":"Uppdragsforskning!$D$36","v":0},"01",{"$f":"IF(_xlfn.NUMBERVALUE(RIGHT(J36,4))=Uppdragsforskning!$D$31,RIGHT(J36,4)&Uppdragsforskning!$E$31,RIGHT(J36,4)&\"12\")","v":"12"},{"$f":"SUM(Uppdragsforskning!J124:K124)","v":0},{"$f":"IF(Uppdragsforskning!$D$36=\"\",\"\",IF(Uppdragsforskning!$D$31<Uppdragsforskning!$D$30+1,\"\",\"Budget \"&Uppdragsforskning!$D$36&\" \"&Uppdragsforskning!J$43))","v":""}]
[null,null,22,"Lokalkostnader",50111,{"$f":"Uppdragsforskning!$D$36","v":0},"01",{"$f":"IF(_xlfn.NUMBERVALUE(RIGHT(J37,4))=Uppdragsforskning!$D$31,RIGHT(J37,4)&Uppdragsforskning!$E$31,RIGHT(J37,4)&\"12\")","v":"12"},{"$f":"SUM(Uppdragsforskning!K$103:K105)","v":0},{"$f":"IF(Uppdragsforskning!$D$36=\"\",\"\",IF(Uppdragsforskning!$D$31<Uppdragsforskning!$D$30+1,\"\",\"Budget \"&Uppdragsforskning!$D$36&\" \"&Uppdragsforskning!J$43))","v":""}]
[null,null,23,"Resekostnader",5522,{"$f":"Uppdragsforskning!$D$36","v":0},{"$f":"RIGHT(J38,4)&\"01\"","v":"01"},{"$f":"IF(_xlfn.NUMBERVALUE(RIGHT(J38,4))=Uppdragsforskning!$D$31,RIGHT(J38,4)&Uppdragsforskning!$E$31,RIGHT(J38,4)&\"12\")","v":"12"},{"$f":"SUM(Uppdragsforskning!K$74:K76)","v":0},{"$f":"IF(Uppdragsforskning!$D$36=\"\",\"\",IF(Uppdragsforskning!$D$31<Uppdragsforskning!$D$30+1,\"\",\"Budget \"&Uppdragsforskning!$D$36&\" \"&Uppdragsforskning!J$43))","v":""}]
[null,null,23,"Övriga driftskostnader",5797,{"$f":"Uppdragsforskning!$D$36","v":0},"01",{"$f":"IF(_xlfn.NUMBERVALUE(RIGHT(J39,4))=Uppdragsforskning!$D$31,RIGHT(J39,4)&Uppdragsforskning!$E$31,RIGHT(J39,4)&\"12\")","v":"12"},{"$f":"SUM(Uppdragsforskning!J92:K92)","v":0},{"$f":"IF(Uppdragsforskning!$D$36=\"\",\"\",IF(Uppdragsforskning!$D$31<Uppdragsforskning!$D$30+1,\"\",\"Budget \"&Uppdragsforskning!$D$36&\" \"&Uppdragsforskning!J$43))","v":""}]
[null,null,23,"Interna kostnader",57849,{"$f":"Uppdragsforskning!$D$36","v":0},"01",{"$f":"IF(_xlfn.NUMBERVALUE(RIGHT(J40,4))=Uppdragsforskning!$D$31,RIGHT(J40,4)&Uppdragsforskning!$E$31,RIGHT(J40,4)&\"12\")","v":"12"},{"$f":"SUM(Uppdragsforskning!K$109:K111)","v":0},{"$f":"IF(Uppdragsforskning!$D$36=\"\",\"\",IF(Uppdragsforskning!$D$31<Uppdragsforskning!$D$30+1,\"\",\"Budget \"&Uppdragsforskning!$D$36&\" \"&Uppdragsforskning!J$43))","v":""}]
[null,null,24,"Avskrivningar",6911,{"$f":"Uppdragsforskning!$D$36","v":0},"01",{"$f":"IF(_xlfn.NUMBERVALUE(RIGHT(J41,4))=Uppdragsforskning!$D$31,RIGHT(J41,4)&Uppdragsforskning!$E$31,RIGHT(J41,4)&\"12\")","v":"12"},{"$f":"SUM(Uppdragsforskning!K$98:K99)","v":0},{"$f":"IF(Uppdragsforskning!$D$36=\"\",\"\",IF(Uppdragsforskning!$D$31<Uppdragsforskning!$D$30+1,\"\",\"Budget \"&Uppdragsforskning!$D$36&\" \"&Uppdragsforskning!J$43))","v":""}]
[null,null,11,"Intäkter av avgifter",3313,{"$f":"Uppdragsforskning!$D$36","v":0},"01",{"$f":"IF(_xlfn.NUMBERVALUE(RIGHT(J42,4))=Uppdragsforskning!$D$31,RIGHT(J42,4)&Uppdragsforskning!$E$31,RIGHT(J42,4)&\"12\")","v":"12"},{"$f":"SUM(Uppdragsforskning!L131:M131)*-1","v":0},{"$f":"IF(Uppdragsforskning!$D$36=\"\",\"\",IF(Uppdragsforskning!$D$31<Uppdragsforskning!$D$30+2,\"\",\"Budget \"&Uppdragsforskning!$D$36&\" \"&Uppdragsforskning!L$43))","v":""}]
[null,null,21,"Personalkostnader",4011,{"$f":"Uppdragsforskning!$D$36","v":0},"01",{"$f":"IF(_xlfn.NUMBERVALUE(RIGHT(J43,4))=Uppdragsforskning!$D$31,RIGHT(J43,4)&Uppdragsforskning!$E$31,RIGHT(J43,4)&\"12\")","v":"12"},{"$f":"SUM(Uppdragsforskning!L65:M65)","v":0},{"$f":"IF(Uppdragsforskning!$D$36=\"\",\"\",IF(Uppdragsforskning!$D$31<Uppdragsforskning!$D$30+2,\"\",\"Budget \"&Uppdragsforskning!$D$36&\" \"&Uppdragsforskning!L$43))","v":""}]
[null,null,211,"Gemensamma kostnader (INDI)",49988,{"$f":"Uppdragsforskning!$D$36","v":0},"01",{"$f":"IF(_xlfn.NUMBERVALUE(RIGHT(J44,4))=Uppdragsforskning!$D$31,RIGHT(J44,4)&Uppdragsforskning!$E$31,RIGHT(J44,4)&\"12\")","v":"12"},{"$f":"SUM(Uppdragsforskning!L124:M124)","v":0},{"$f":"IF(Uppdragsforskning!$D$36=\"\",\"\",IF(Uppdragsforskning!$D$31<Uppdragsforskning!$D$30+2,\"\",\"Budget \"&Uppdragsforskning!$D$36&\" \"&Uppdragsforskning!L$43))","v":""}]
[null,null,22,"Lokalkostnader",50111,{"$f":"Uppdragsforskning!$D$36","v":0},"01",{"$f":"IF(_xlfn.NUMBERVALUE(RIGHT(J45,4))=Uppdragsforskning!$D$31,RIGHT(J45,4)&Uppdragsforskning!$E$31,RIGHT(J45,4)&\"12\")","v":"12"},{"$f":"SUM(Uppdragsforskning!M$103:M105)","v":0},{"$f":"IF(Uppdragsforskning!$D$36=\"\",\"\",IF(Uppdragsforskning!$D$31<Uppdragsforskning!$D$30+2,\"\",\"Budget \"&Uppdragsforskning!$D$36&\" \"&Uppdragsforskning!L$43))","v":""}]
[null,null,23,"Resekostnader",5522,{"$f":"Uppdragsforskning!$D$36","v":0},"01",{"$f":"IF(_xlfn.NUMBERVALUE(RIGHT(J46,4))=Uppdragsforskning!$D$31,RIGHT(J46,4)&Uppdragsforskning!$E$31,RIGHT(J46,4)&\"12\")","v":"12"},{"$f":"SUM(Uppdragsforskning!M$74:M76)","v":0},{"$f":"IF(Uppdragsforskning!$D$36=\"\",\"\",IF(Uppdragsforskning!$D$31<Uppdragsforskning!$D$30+2,\"\",\"Budget \"&Uppdragsforskning!$D$36&\" \"&Uppdragsforskning!L$43))","v":""}]
[null,null,23,"Övriga driftskostnader",5797,{"$f":"Uppdragsforskning!$D$36","v":0},"01",{"$f":"IF(_xlfn.NUMBERVALUE(RIGHT(J47,4))=Uppdragsforskning!$D$31,RIGHT(J47,4)&Uppdragsforskning!$E$31,RIGHT(J47,4)&\"12\")","v":"12"},{"$f":"SUM(Uppdragsforskning!L92:M92)","v":0},{"$f":"IF(Uppdragsforskning!$D$36=\"\",\"\",IF(Uppdragsforskning!$D$31<Uppdragsforskning!$D$30+2,\"\",\"Budget \"&Uppdragsforskning!$D$36&\" \"&Uppdragsforskning!L$43))","v":""}]
[null,null,23,"Interna kostnader",57849,{"$f":"Uppdragsforskning!$D$36","v":0},"01",{"$f":"IF(_xlfn.NUMBERVALUE(RIGHT(J48,4))=Uppdragsforskning!$D$31,RIGHT(J48,4)&Uppdragsforskning!$E$31,RIGHT(J48,4)&\"12\")","v":"12"},{"$f":"SUM(Uppdragsforskning!M$109:M111)","v":0},{"$f":"IF(Uppdragsforskning!$D$36=\"\",\"\",IF(Uppdragsforskning!$D$31<Uppdragsforskning!$D$30+2,\"\",\"Budget \"&Uppdragsforskning!$D$36&\" \"&Uppdragsforskning!L$43))","v":""}]
[null,null,24,"Avskrivningar",6911,{"$f":"Uppdragsforskning!$D$36","v":0},"01",{"$f":"IF(_xlfn.NUMBERVALUE(RIGHT(J49,4))=Uppdragsforskning!$D$31,RIGHT(J49,4)&Uppdragsforskning!$E$31,RIGHT(J49,4)&\"12\")","v":"12"},{"$f":"SUM(Uppdragsforskning!M$98:M99)","v":0},{"$f":"IF(Uppdragsforskning!$D$36=\"\",\"\",IF(Uppdragsforskning!$D$31<Uppdragsforskning!$D$30+2,\"\",\"Budget \"&Uppdragsforskning!$D$36&\" \"&Uppdragsforskning!L$43))","v":""}]
[null,null,11,"Intäkter av avgifter",3313,{"$f":"Uppdragsforskning!$D$36","v":0},"01",{"$f":"IF(_xlfn.NUMBERVALUE(RIGHT(J50,4))=Uppdragsforskning!$D$31,RIGHT(J50,4)&Uppdragsforskning!$E$31,RIGHT(J50,4)&\"12\")","v":"12"},{"$f":"SUM(Uppdragsforskning!N131:O131)*-1","v":0},{"$f":"IF(Uppdragsforskning!$D$36=\"\",\"\",IF(Uppdragsforskning!$D$31<Uppdragsforskning!$D$30+3,\"\",\"Budget \"&Uppdragsforskning!$D$36&\" \"&Uppdragsforskning!N$43))","v":""}]
[null,null,21,"Personalkostnader",4011,{"$f":"Uppdragsforskning!$D$36","v":0},"01",{"$f":"IF(_xlfn.NUMBERVALUE(RIGHT(J51,4))=Uppdragsforskning!$D$31,RIGHT(J51,4)&Uppdragsforskning!$E$31,RIGHT(J51,4)&\"12\")","v":"12"},{"$f":"SUM(Uppdragsforskning!N65:O65)","v":0},{"$f":"IF(Uppdragsforskning!$D$36=\"\",\"\",IF(Uppdragsforskning!$D$31<Uppdragsforskning!$D$30+3,\"\",\"Budget \"&Uppdragsforskning!$D$36&\" \"&Uppdragsforskning!N$43))","v":""}]
[null,null,211,"Gemensamma kostnader (INDI)",49988,{"$f":"Uppdragsforskning!$D$36","v":0},"01",{"$f":"IF(_xlfn.NUMBERVALUE(RIGHT(J52,4))=Uppdragsforskning!$D$31,RIGHT(J52,4)&Uppdragsforskning!$E$31,RIGHT(J52,4)&\"12\")","v":"12"},{"$f":"SUM(Uppdragsforskning!N124:O124)","v":0},{"$f":"IF(Uppdragsforskning!$D$36=\"\",\"\",IF(Uppdragsforskning!$D$31<Uppdragsforskning!$D$30+3,\"\",\"Budget \"&Uppdragsforskning!$D$36&\" \"&Uppdragsforskning!N$43))","v":""}]
[null,null,22,"Lokalkostnader",50111,{"$f":"Uppdragsforskning!$D$36","v":0},"01",{"$f":"IF(_xlfn.NUMBERVALUE(RIGHT(J53,4))=Uppdragsforskning!$D$31,RIGHT(J53,4)&Uppdragsforskning!$E$31,RIGHT(J53,4)&\"12\")","v":"12"},{"$f":"SUM(Uppdragsforskning!O$103:O105)","v":0},{"$f":"IF(Uppdragsforskning!$D$36=\"\",\"\",IF(Uppdragsforskning!$D$31<Uppdragsforskning!$D$30+3,\"\",\"Budget \"&Uppdragsforskning!$D$36&\" \"&Uppdragsforskning!N$43))","v":""}]
[null,null,23,"Resekostnader",5522,{"$f":"Uppdragsforskning!$D$36","v":0},"01",{"$f":"IF(_xlfn.NUMBERVALUE(RIGHT(J54,4))=Uppdragsforskning!$D$31,RIGHT(J54,4)&Uppdragsforskning!$E$31,RIGHT(J54,4)&\"12\")","v":"12"},{"$f":"SUM(Uppdragsforskning!O$74:O76)","v":0},{"$f":"IF(Uppdragsforskning!$D$36=\"\",\"\",IF(Uppdragsforskning!$D$31<Uppdragsforskning!$D$30+3,\"\",\"Budget \"&Uppdragsforskning!$D$36&\" \"&Uppdragsforskning!N$43))","v":""}]
[null,null,23,"Övriga driftskostnader",5797,{"$f":"Uppdragsforskning!$D$36","v":0},"01",{"$f":"IF(_xlfn.NUMBERVALUE(RIGHT(J55,4))=Uppdragsforskning!$D$31,RIGHT(J55,4)&Uppdragsforskning!$E$31,RIGHT(J55,4)&\"12\")","v":"12"},{"$f":"SUM(Uppdragsforskning!N92:O92)","v":0},{"$f":"IF(Uppdragsforskning!$D$36=\"\",\"\",IF(Uppdragsforskning!$D$31<Uppdragsforskning!$D$30+3,\"\",\"Budget \"&Uppdragsforskning!$D$36&\" \"&Uppdragsforskning!N$43))","v":""}]
[null,null,23,"Interna kostnader",57849,{"$f":"Uppdragsforskning!$D$36","v":0},"01",{"$f":"IF(_xlfn.NUMBERVALUE(RIGHT(J56,4))=Uppdragsforskning!$D$31,RIGHT(J56,4)&Uppdragsforskning!$E$31,RIGHT(J56,4)&\"12\")","v":"12"},{"$f":"SUM(Uppdragsforskning!O$109:O111)","v":0},{"$f":"IF(Uppdragsforskning!$D$36=\"\",\"\",IF(Uppdragsforskning!$D$31<Uppdragsforskning!$D$30+3,\"\",\"Budget \"&Uppdragsforskning!$D$36&\" \"&Uppdragsforskning!N$43))","v":""}]
[null,null,24,"Avskrivningar",6911,{"$f":"Uppdragsforskning!$D$36","v":0},"01",{"$f":"IF(_xlfn.NUMBERVALUE(RIGHT(J57,4))=Uppdragsforskning!$D$31,RIGHT(J57,4)&Uppdragsforskning!$E$31,RIGHT(J57,4)&\"12\")","v":"12"},{"$f":"SUM(Uppdragsforskning!O$98:O99)","v":0},{"$f":"IF(Uppdragsforskning!$D$36=\"\",\"\",IF(Uppdragsforskning!$D$31<Uppdragsforskning!$D$30+3,\"\",\"Budget \"&Uppdragsforskning!$D$36&\" \"&Uppdragsforskning!N$43))","v":""}]
[null,null,11,"Intäkter av avgifter",3313,{"$f":"Uppdragsforskning!$D$36","v":0},"01",{"$f":"IF(_xlfn.NUMBERVALUE(RIGHT(J58,4))=Uppdragsforskning!$D$31,RIGHT(J58,4)&Uppdragsforskning!$E$31,RIGHT(J58,4)&\"12\")","v":"12"},{"$f":"SUM(Uppdragsforskning!P131:Q131)*-1","v":0},{"$f":"IF(Uppdragsforskning!$D$36=\"\",\"\",IF(Uppdragsforskning!$D$31<Uppdragsforskning!$D$30+4,\"\",\"Budget \"&Uppdragsforskning!$D$36&\" \"&Uppdragsforskning!P$43))","v":""}]
[null,null,21,"Personalkostnader",4011,{"$f":"Uppdragsforskning!$D$36","v":0},"01",{"$f":"IF(_xlfn.NUMBERVALUE(RIGHT(J59,4))=Uppdragsforskning!$D$31,RIGHT(J59,4)&Uppdragsforskning!$E$31,RIGHT(J59,4)&\"12\")","v":"12"},{"$f":"SUM(Uppdragsforskning!P65:Q65)","v":0},{"$f":"IF(Uppdragsforskning!$D$36=\"\",\"\",IF(Uppdragsforskning!$D$31<Uppdragsforskning!$D$30+4,\"\",\"Budget \"&Uppdragsforskning!$D$36&\" \"&Uppdragsforskning!P$43))","v":""}]
[null,null,211,"Gemensamma kostnader (INDI)",49988,{"$f":"Uppdragsforskning!$D$36","v":0},"01",{"$f":"IF(_xlfn.NUMBERVALUE(RIGHT(J60,4))=Uppdragsforskning!$D$31,RIGHT(J60,4)&Uppdragsforskning!$E$31,RIGHT(J60,4)&\"12\")","v":"12"},{"$f":"SUM(Uppdragsforskning!P124:Q124)","v":0},{"$f":"IF(Uppdragsforskning!$D$36=\"\",\"\",IF(Uppdragsforskning!$D$31<Uppdragsforskning!$D$30+4,\"\",\"Budget \"&Uppdragsforskning!$D$36&\" \"&Uppdragsforskning!P$43))","v":""}]
[null,null,22,"Lokalkostnader",50111,{"$f":"Uppdragsforskning!$D$36","v":0},"01",{"$f":"IF(_xlfn.NUMBERVALUE(RIGHT(J61,4))=Uppdragsforskning!$D$31,RIGHT(J61,4)&Uppdragsforskning!$E$31,RIGHT(J61,4)&\"12\")","v":"12"},{"$f":"SUM(Uppdragsforskning!Q$103:Q105)","v":0},{"$f":"IF(Uppdragsforskning!$D$36=\"\",\"\",IF(Uppdragsforskning!$D$31<Uppdragsforskning!$D$30+4,\"\",\"Budget \"&Uppdragsforskning!$D$36&\" \"&Uppdragsforskning!P$43))","v":""}]
[null,null,23,"Resekostnader",5522,{"$f":"Uppdragsforskning!$D$36","v":0},"01",{"$f":"IF(_xlfn.NUMBERVALUE(RIGHT(J62,4))=Uppdragsforskning!$D$31,RIGHT(J62,4)&Uppdragsforskning!$E$31,RIGHT(J62,4)&\"12\")","v":"12"},{"$f":"SUM(Uppdragsforskning!Q$74:Q76)","v":0},{"$f":"IF(Uppdragsforskning!$D$36=\"\",\"\",IF(Uppdragsforskning!$D$31<Uppdragsforskning!$D$30+4,\"\",\"Budget \"&Uppdragsforskning!$D$36&\" \"&Uppdragsforskning!P$43))","v":""}]
[null,null,23,"Övriga driftskostnader",5797,{"$f":"Uppdragsforskning!$D$36","v":0},"01",{"$f":"IF(_xlfn.NUMBERVALUE(RIGHT(J63,4))=Uppdragsforskning!$D$31,RIGHT(J63,4)&Uppdragsforskning!$E$31,RIGHT(J63,4)&\"12\")","v":"12"},{"$f":"SUM(Uppdragsforskning!P92:Q92)","v":0},{"$f":"IF(Uppdragsforskning!$D$36=\"\",\"\",IF(Uppdragsforskning!$D$31<Uppdragsforskning!$D$30+4,\"\",\"Budget \"&Uppdragsforskning!$D$36&\" \"&Uppdragsforskning!P$43))","v":""}]
[null,null,23,"Interna kostnader",57849,{"$f":"Uppdragsforskning!$D$36","v":0},"01",{"$f":"IF(_xlfn.NUMBERVALUE(RIGHT(J64,4))=Uppdragsforskning!$D$31,RIGHT(J64,4)&Uppdragsforskning!$E$31,RIGHT(J64,4)&\"12\")","v":"12"},{"$f":"SUM(Uppdragsforskning!Q$109:Q111)","v":0},{"$f":"IF(Uppdragsforskning!$D$36=\"\",\"\",IF(Uppdragsforskning!$D$31<Uppdragsforskning!$D$30+4,\"\",\"Budget \"&Uppdragsforskning!$D$36&\" \"&Uppdragsforskning!P$43))","v":""}]
[null,null,24,"Avskrivningar",6911,{"$f":"Uppdragsforskning!$D$36","v":0},"01",{"$f":"IF(_xlfn.NUMBERVALUE(RIGHT(J65,4))=Uppdragsforskning!$D$31,RIGHT(J65,4)&Uppdragsforskning!$E$31,RIGHT(J65,4)&\"12\")","v":"12"},{"$f":"SUM(Uppdragsforskning!Q$98:Q99)","v":0},{"$f":"IF(Uppdragsforskning!$D$36=\"\",\"\",IF(Uppdragsforskning!$D$31<Uppdragsforskning!$D$30+4,\"\",\"Budget \"&Uppdragsforskning!$D$36&\" \"&Uppdragsforskning!P$43))","v":""}]

{"sheet":"Bidragsforskning VR (Prisma)","index":3,"n_rows":131,"n_cols":31,"rows_kept":131,"cut":false,"hidden":true,"merged":[[6,7,9,19],[45,6,45,14],[46,6,46,14],[47,6,47,14],[48,6,48,14],[28,6,28,14],[29,6,29,14],[30,6,30,14],[31,6,31,14],[35,6,35,14],[36,6,36,14],[37,6,37,14],[38,6,38,14],[39,6,39,14],[17,6,17,14],[18,6,18,14],[19,6,19,14],[20,6,20,14],[21,6,21,14],[23,6,23,14],[24,6,24,14],[25,6,25,14],[26,6,26,14],[27,6,27,14],[90,1,90,16],[92,3,92,5],[93,3,93,5],[82,3,82,5],[83,3,83,5],[84,3,84,5],[85,3,85,5],[86,3,86,5],[87,3,87,5],[88,3,88,5],[89,3,89,5],[91,3,91,5],[109,3,109,5],[94,3,94,5],[95,3,95,5],[100,3,100,5],[99,3,99,5],[101,3,101,5],[102,3,102,5],[103,3,103,5],[104,3,104,5],[105,3,105,5],[106,3,106,5],[107,3,107,5],[108,3,108,5],[81,3,81,5],[35,2,35,5],[36,2,36,5],[37,2,37,5],[47,2,47,5],[48,2,48,5],[49,2,49,5],[44,2,44,5],[45,2,45,5],[46,2,46,5],[52,2,52,5],[53,2,53,5],[54,2,54,5],[55,2,55,5],[56,2,56,5],[57,2,57,5],[58,2,58,5],[59,2,59,5],[60,2,60,5],[61,2,61,5],[62,2,62,5],[63,2,63,5],[64,2,64,5],[65,2,65,5],[25,2,25,5],[26,2,26,5],[17,2,17,5],[18,2,18,5],[19,2,19,5],[20,2,20,5],[21,2,21,5],[79,3,79,5],[80,3,80,5],[66,2,66,5],[70,3,70,5],[71,2,71,5],[72,2,72,5],[73,2,73,5],[74,2,74,5],[75,2,75,5],[49,6,49,14],[22,6,22,14],[40,6,40,14],[41,6,41,14],[42,6,42,14],[43,6,43,14],[44,6,44,14],[7,3,7,5],[8,3,8,5],[9,3,9,5],[41,2,41,5],[42,2,42,5],[43,2,43,5],[38,2,38,5],[39,2,39,5],[40,2,40,5],[27,2,27,5],[28,2,28,5],[29,2,29,5],[30,2,30,5],[31,2,31,5],[22,2,22,5],[23,2,23,5],[24,2,24,5]]}
[]
[null,"GRUNDLÄGGANDE UPPGIFTER",null,null,null,null,null,null,null,null,null,null,null,null,null,null,"Klicka på + ovan för att öppna upp fler år"]
[]
[null,"Institutionskod",null,null,null,null,null,"Lönekostnadspålägg (LKP)",null,null,{"$f":"Bidragsforskning!G73","v":0.55859999999999999}]
[null,"Innevrande år",null,{"$f":"Tabeller!$A$1","v":2025},null,null,null,"Indirektakostnader - pålägg (INDI)",null,null,{"$f":"_xlfn.IFNA(VLOOKUP(LEFT(D4,2),'INDI FO 2025'!A:G,7,0),\"Välj institution\")","v":"Välj institution"}]
[null,"Projektets start år/månad"]
[null,"Projektets slut år/månad",null,null,null,null,null,"Fyll först i de grundläggande uppgifterna i denna sektion. All ekonomisk information anges i kolumn S till AE i respektive sektion. Kalkylmallen innehåller informationsrutor som beskriver respektive sektion/kolumn,  de visas när man markerar en cell.\n\nI kalkylbladet är celler innehållande formler skyddade, vill man manuellt ange/ändra något så går det att ta bort skyddet genom att i verktygsfältet välja Granska och sen alternativet Ta bort bladets skydd."]
[null,"Projektledare/-ansvarig"]
[null,"Projektnummer - UBW"]
[null,"Beskrivnig av projektet"]
[]
[]
[]
[null,"Budget och forskningsresurser"]
[]
[null,"Aktivitetsgrad i projektet"]
[null,null,"Roll i projektet",null,null,null,"Namn",null,null,null,null,null,null,null,null,null,"Procent av heltid"]
[null,1]
[null,2]
[null,3]
[null,4]
[null,5]
[null,6]
[null,7]
[null,8]
[null,9]
[null,10]
[null,11]
[null,12]
[null,13]
[null,14]
[null,15]
[]
[null,"Löner inklusive sociala avgifter",null,null,null,null,null,null,null,null,null,null,null,null,null,null,null,null,null,null,{"$f":"G$52","v":"Välj start år"},"",{"$f":"I$52","v":""},{"$f":"J$52","v":""},"","","","","",""]
[null,null,"Roll i projektet",null,null,null,"Namn",null,null,null,null,null,null,null,null,null,"Procent av lönen",null,"Månadslön","Indexering","Omf %","Omf %","Omf %","Omf %","Omf %","Omf %","Omf %","Omf %","Omf %","Omf %"]
[null,1,null,null,null,null,null,null,null,null,null,null,null,null,null,null,{"$f":"IFERROR(SUM(U36:AD36)/COUNTA(U36:AD36),\"\")","v":""},null,null,0.04]
[null,2,null,null,null,null,null,null,null,null,null,null,null,null,null,null,{"$f":"IFERROR(SUM(U37:AD37)/COUNTA(U37:AD37),\"\")","v":""},null,null,0.04]
[null,3,null,null,null,null,null,null,null,null,null,null,null,null,null,null,"",null,null,0.04]
[null,4,null,null,null,null,null,null,null,null,null,null,null,null,null,null,"",null,null,0.04]
[null,5,null,null,null,null,null,null,null,null,null,null,null,null,null,null,"",null,null,0.04]
[null,6,null,null,null,null,null,null,null,null,null,null,null,null,null,null,"",null,null,0.04]
[null,7,null,null,null,null,null,null,null,null,null,null,null,null,null,null,{"$f":"IFERROR(SUM(U42:AD42)/COUNTA(U42:AD42),\"\")","v":""},null,null,0.04]
[null,8,null,null,null,null,null,null,null,null,null,null,null,null,null,null,"",null,null,0.04]
[null,9,null,null,null,null,null,null,null,null,null,null,null,null,null,null,"",null,null,0.04]
[null,10,null,null,null,null,null,null,null,null,null,null,null,null,null,null,"",null,null,0.04]
[null,11,null,null,null,null,null,null,null,null,null,null,null,null,null,null,"",null,null,0.04]
[null,12,null,null,null,null,null,null,null,null,null,null,null,null,null,null,"",null,null,0.04]
[null,13,null,null,null,null,null,null,null,null,null,null,null,null,null,null,"",null,null,0.04]
[null,14,null,null,null,null,null,null,null,null,null,null,null,null,null,null,"",null,null,0.04]
[null,15,null,null,null,null,null,null,null,null,null,null,null,null,null,null,"",null,null,0.04]
[null,"Totalt"]
[null,null,"Namn",null,null,null,{"$f":"IF($D$6=0,\"Välj start år\",$D$6)","v":"Välj start år"},{"$f":"IFERROR(G52+1,\"\")","v":""},{"$f":"IFERROR(H52+1,\"\")","v":""},"","","","","","","","Totalt"]
[null,1,{"$f":"IF(G36=\"\",\"\",G36)","v":""},null,null,null,{"$f":"IF(IF($S36=\"\",\"\",ROUND($S36*U36*12*(1+$K$4),0))=0,\"\",IF($S36=\"\",\"\",ROUND($S36*U36*12*(1+$K$4),0)))","v":""},{"$f":"IF($S36=\"\",\"\",IF(G53=\"\",ROUND($S36*V36*12*(1+$K$4),0),ROUND($S36*V36*12*(1+$K$4)*(1+$T36),0)))","v":""},{"$f":"IF($S36=\"\",\"\",IF(COUNTA($U36:V36)=0,ROUND($S36*W36*12*(1+$K$4),0),ROUND($S36*W36*12*(1+$K$4)*((1+$T36)^COUNTA($U36:V36)),0)))","v":""},{"$f":"IF($S36=\"\",\"\",IF(COUNTA($U36:W36)=0,ROUND($S36*X36*12*(1+$K$4),0),ROUND($S36*X36*12*(1+$K$4)*((1+$T36)^COUNTA($U36:W36)),0)))","v":""},{"$f":"IF($S36=\"\",\"\",IF(COUNTA($U36:X36)=0,ROUND($S36*Y36*12*(1+$K$4),0),ROUND($S36*Y36*12*(1+$K$4)*((1+$T36)^COUNTA($U36:X36)),0)))","v":""},{"$f":"IF($S36=\"\",\"\",IF(COUNTA($U36:Y36)=0,ROUND($S36*Z36*12*(1+$K$4),0),ROUND($S36*Z36*12*(1+$K$4)*((1+$T36)^COUNTA($U36:Y36)),0)))","v":""},{"$f":"IF($S36=\"\",\"\",IF(COUNTA($U36:Z36)=0,ROUND($S36*AA36*12*(1+$K$4),0),ROUND($S36*AA36*12*(1+$K$4)*((1+$T36)^COUNTA($U36:Z36)),0)))","v":""},{"$f":"IF($S36=\"\",\"\",IF(COUNTA($U36:AA36)=0,ROUND($S36*AB36*12*(1+$K$4),0),ROUND($S36*AB36*12*(1+$K$4)*((1+$T36)^COUNTA($U36:AA36)),0)))","v":""},{"$f":"IF($S36=\"\",\"\",IF(COUNTA($U36:AB36)=0,ROUND($S36*AC36*12*(1+$K$4),0),ROUND($S36*AC36*12*(1+$K$4)*((1+$T36)^COUNTA($U36:AB36)),0)))","v":""},{"$f":"IF($S36=\"\",\"\",IF(COUNTA($U36:AC36)=0,ROUND($S36*AD36*12*(1+$K$4),0),ROUND($S36*AD36*12*(1+$K$4)*((1+$T36)^COUNTA($U36:AC36)),0)))","v":""},{"$f":"IF(SUM(G53:P53)=0,\"\",SUM(G53:P53))","v":""}]
[null,2,{"$f":"IF(G37=\"\",\"\",G37)","v":""},null,null,null,{"$f":"IF(IF($S37=\"\",\"\",ROUND($S37*U37*12*(1+$K$4),0))=0,\"\",IF($S37=\"\",\"\",ROUND($S37*U37*12*(1+$K$4),0)))","v":""},{"$f":"IF($S37=\"\",\"\",IF(G54=\"\",ROUND($S37*V37*12*(1+$K$4),0),ROUND($S37*V37*12*(1+$K$4)*(1+$T37),0)))","v":""},{"$f":"IF($S37=\"\",\"\",IF(COUNTA($U37:V37)=0,ROUND($S37*W37*12*(1+$K$4),0),ROUND($S37*W37*12*(1+$K$4)*((1+$T37)^COUNTA($U37:V37)),0)))","v":""},{"$f":"IF($S37=\"\",\"\",IF(COUNTA($U37:W37)=0,ROUND($S37*X37*12*(1+$K$4),0),ROUND($S37*X37*12*(1+$K$4)*((1+$T37)^COUNTA($U37:W37)),0)))","v":""},{"$f":"IF($S37=\"\",\"\",IF(COUNTA($U37:X37)=0,ROUND($S37*Y37*12*(1+$K$4),0),ROUND($S37*Y37*12*(1+$K$4)*((1+$T37)^COUNTA($U37:X37)),0)))","v":""},{"$f":"IF($S37=\"\",\"\",IF(COUNTA($U37:Y37)=0,ROUND($S37*Z37*12*(1+$K$4),0),ROUND($S37*Z37*12*(1+$K$4)*((1+$T37)^COUNTA($U37:Y37)),0)))","v":""},{"$f":"IF($S37=\"\",\"\",IF(COUNTA($U37:Z37)=0,ROUND($S37*AA37*12*(1+$K$4),0),ROUND($S37*AA37*12*(1+$K$4)*((1+$T37)^COUNTA($U37:Z37)),0)))","v":""},{"$f":"IF($S37=\"\",\"\",IF(COUNTA($U37:AA37)=0,ROUND($S37*AB37*12*(1+$K$4),0),ROUND($S37*AB37*12*(1+$K$4)*((1+$T37)^COUNTA($U37:AA37)),0)))","v":""},{"$f":"IF($S37=\"\",\"\",IF(COUNTA($U37:AB37)=0,ROUND($S37*AC37*12*(1+$K$4),0),ROUND($S37*AC37*12*(1+$K$4)*((1+$T37)^COUNTA($U37:AB37)),0)))","v":""},{"$f":"IF($S37=\"\",\"\",IF(COUNTA($U37:AC37)=0,ROUND($S37*AD37*12*(1+$K$4),0),ROUND($S37*AD37*12*(1+$K$4)*((1+$T37)^COUNTA($U37:AC37)),0)))","v":""},{"$f":"IF(SUM(G54:P54)=0,\"\",SUM(G54:P54))","v":""}]
[null,3,"",null,null,null,"",{"$f":"IF($S38=\"\",\"\",IF(G55=\"\",ROUND($S38*V38*12*(1+$K$4),0),ROUND($S38*V38*12*(1+$K$4)*(1+$T38),0)))","v":""},{"$f":"IF($S38=\"\",\"\",IF(COUNTA($U38:V38)=0,ROUND($S38*W38*12*(1+$K$4),0),ROUND($S38*W38*12*(1+$K$4)*((1+$T38)^COUNTA($U38:V38)),0)))","v":""},{"$f":"IF($S38=\"\",\"\",IF(COUNTA($U38:W38)=0,ROUND($S38*X38*12*(1+$K$4),0),ROUND($S38*X38*12*(1+$K$4)*((1+$T38)^COUNTA($U38:W38)),0)))","v":""},{"$f":"IF($S38=\"\",\"\",IF(COUNTA($U38:X38)=0,ROUND($S38*Y38*12*(1+$K$4),0),ROUND($S38*Y38*12*(1+$K$4)*((1+$T38)^COUNTA($U38:X38)),0)))","v":""},{"$f":"IF($S38=\"\",\"\",IF(COUNTA($U38:Y38)=0,ROUND($S38*Z38*12*(1+$K$4),0),ROUND($S38*Z38*12*(1+$K$4)*((1+$T38)^COUNTA($U38:Y38)),0)))","v":""},{"$f":"IF($S38=\"\",\"\",IF(COUNTA($U38:Z38)=0,ROUND($S38*AA38*12*(1+$K$4),0),ROUND($S38*AA38*12*(1+$K$4)*((1+$T38)^COUNTA($U38:Z38)),0)))","v":""},{"$f":"IF($S38=\"\",\"\",IF(COUNTA($U38:AA38)=0,ROUND($S38*AB38*12*(1+$K$4),0),ROUND($S38*AB38*12*(1+$K$4)*((1+$T38)^COUNTA($U38:AA38)),0)))","v":""},{"$f":"IF($S38=\"\",\"\",IF(COUNTA($U38:AB38)=0,ROUND($S38*AC38*12*(1+$K$4),0),ROUND($S38*AC38*12*(1+$K$4)*((1+$T38)^COUNTA($U38:AB38)),0)))","v":""},{"$f":"IF($S38=\"\",\"\",IF(COUNTA($U38:AC38)=0,ROUND($S38*AD38*12*(1+$K$4),0),ROUND($S38*AD38*12*(1+$K$4)*((1+$T38)^COUNTA($U38:AC38)),0)))","v":""},""]
[null,4,"",null,null,null,"",{"$f":"IF($S39=\"\",\"\",IF(G56=\"\",ROUND($S39*V39*12*(1+$K$4),0),ROUND($S39*V39*12*(1+$K$4)*(1+$T39),0)))","v":""},{"$f":"IF($S39=\"\",\"\",IF(COUNTA($U39:V39)=0,ROUND($S39*W39*12*(1+$K$4),0),ROUND($S39*W39*12*(1+$K$4)*((1+$T39)^COUNTA($U39:V39)),0)))","v":""},{"$f":"IF($S39=\"\",\"\",IF(COUNTA($U39:W39)=0,ROUND($S39*X39*12*(1+$K$4),0),ROUND($S39*X39*12*(1+$K$4)*((1+$T39)^COUNTA($U39:W39)),0)))","v":""},{"$f":"IF($S39=\"\",\"\",IF(COUNTA($U39:X39)=0,ROUND($S39*Y39*12*(1+$K$4),0),ROUND($S39*Y39*12*(1+$K$4)*((1+$T39)^COUNTA($U39:X39)),0)))","v":""},{"$f":"IF($S39=\"\",\"\",IF(COUNTA($U39:Y39)=0,ROUND($S39*Z39*12*(1+$K$4),0),ROUND($S39*Z39*12*(1+$K$4)*((1+$T39)^COUNTA($U39:Y39)),0)))","v":""},{"$f":"IF($S39=\"\",\"\",IF(COUNTA($U39:Z39)=0,ROUND($S39*AA39*12*(1+$K$4),0),ROUND($S39*AA39*12*(1+$K$4)*((1+$T39)^COUNTA($U39:Z39)),0)))","v":""},{"$f":"IF($S39=\"\",\"\",IF(COUNTA($U39:AA39)=0,ROUND($S39*AB39*12*(1+$K$4),0),ROUND($S39*AB39*12*(1+$K$4)*((1+$T39)^COUNTA($U39:AA39)),0)))","v":""},{"$f":"IF($S39=\"\",\"\",IF(COUNTA($U39:AB39)=0,ROUND($S39*AC39*12*(1+$K$4),0),ROUND($S39*AC39*12*(1+$K$4)*((1+$T39)^COUNTA($U39:AB39)),0)))","v":""},{"$f":"IF($S39=\"\",\"\",IF(COUNTA($U39:AC39)=0,ROUND($S39*AD39*12*(1+$K$4),0),ROUND($S39*AD39*12*(1+$K$4)*((1+$T39)^COUNTA($U39:AC39)),0)))","v":""},""]
[null,5,"",null,null,null,"",{"$f":"IF($S40=\"\",\"\",IF(G57=\"\",ROUND($S40*V40*12*(1+$K$4),0),ROUND($S40*V40*12*(1+$K$4)*(1+$T40),0)))","v":""},{"$f":"IF($S40=\"\",\"\",IF(COUNTA($U40:V40)=0,ROUND($S40*W40*12*(1+$K$4),0),ROUND($S40*W40*12*(1+$K$4)*((1+$T40)^COUNTA($U40:V40)),0)))","v":""},{"$f":"IF($S40=\"\",\"\",IF(COUNTA($U40:W40)=0,ROUND($S40*X40*12*(1+$K$4),0),ROUND($S40*X40*12*(1+$K$4)*((1+$T40)^COUNTA($U40:W40)),0)))","v":""},{"$f":"IF($S40=\"\",\"\",IF(COUNTA($U40:X40)=0,ROUND($S40*Y40*12*(1+$K$4),0),ROUND($S40*Y40*12*(1+$K$4)*((1+$T40)^COUNTA($U40:X40)),0)))","v":""},{"$f":"IF($S40=\"\",\"\",IF(COUNTA($U40:Y40)=0,ROUND($S40*Z40*12*(1+$K$4),0),ROUND($S40*Z40*12*(1+$K$4)*((1+$T40)^COUNTA($U40:Y40)),0)))","v":""},{"$f":"IF($S40=\"\",\"\",IF(COUNTA($U40:Z40)=0,ROUND($S40*AA40*12*(1+$K$4),0),ROUND($S40*AA40*12*(1+$K$4)*((1+$T40)^COUNTA($U40:Z40)),0)))","v":""},{"$f":"IF($S40=\"\",\"\",IF(COUNTA($U40:AA40)=0,ROUND($S40*AB40*12*(1+$K$4),0),ROUND($S40*AB40*12*(1+$K$4)*((1+$T40)^COUNTA($U40:AA40)),0)))","v":""},{"$f":"IF($S40=\"\",\"\",IF(COUNTA($U40:AB40)=0,ROUND($S40*AC40*12*(1+$K$4),0),ROUND($S40*AC40*12*(1+$K$4)*((1+$T40)^COUNTA($U40:AB40)),0)))","v":""},{"$f":"IF($S40=\"\",\"\",IF(COUNTA($U40:AC40)=0,ROUND($S40*AD40*12*(1+$K$4),0),ROUND($S40*AD40*12*(1+$K$4)*((1+$T40)^COUNTA($U40:AC40)),0)))","v":""},""]
[null,6,"",null,null,null,"",{"$f":"IF($S41=\"\",\"\",IF(G58=\"\",ROUND($S41*V41*12*(1+$K$4),0),ROUND($S41*V41*12*(1+$K$4)*(1+$T41),0)))","v":""},{"$f":"IF($S41=\"\",\"\",IF(COUNTA($U41:V41)=0,ROUND($S41*W41*12*(1+$K$4),0),ROUND($S41*W41*12*(1+$K$4)*((1+$T41)^COUNTA($U41:V41)),0)))","v":""},{"$f":"IF($S41=\"\",\"\",IF(COUNTA($U41:W41)=0,ROUND($S41*X41*12*(1+$K$4),0),ROUND($S41*X41*12*(1+$K$4)*((1+$T41)^COUNTA($U41:W41)),0)))","v":""},{"$f":"IF($S41=\"\",\"\",IF(COUNTA($U41:X41)=0,ROUND($S41*Y41*12*(1+$K$4),0),ROUND($S41*Y41*12*(1+$K$4)*((1+$T41)^COUNTA($U41:X41)),0)))","v":""},{"$f":"IF($S41=\"\",\"\",IF(COUNTA($U41:Y41)=0,ROUND($S41*Z41*12*(1+$K$4),0),ROUND($S41*Z41*12*(1+$K$4)*((1+$T41)^COUNTA($U41:Y41)),0)))","v":""},{"$f":"IF($S41=\"\",\"\",IF(COUNTA($U41:Z41)=0,ROUND($S41*AA41*12*(1+$K$4),0),ROUND($S41*AA41*12*(1+$K$4)*((1+$T41)^COUNTA($U41:Z41)),0)))","v":""},{"$f":"IF($S41=\"\",\"\",IF(COUNTA($U41:AA41)=0,ROUND($S41*AB41*12*(1+$K$4),0),ROUND($S41*AB41*12*(1+$K$4)*((1+$T41)^COUNTA($U41:AA41)),0)))","v":""},{"$f":"IF($S41=\"\",\"\",IF(COUNTA($U41:AB41)=0,ROUND($S41*AC41*12*(1+$K$4),0),ROUND($S41*AC41*12*(1+$K$4)*((1+$T41)^COUNTA($U41:AB41)),0)))","v":""},{"$f":"IF($S41=\"\",\"\",IF(COUNTA($U41:AC41)=0,ROUND($S41*AD41*12*(1+$K$4),0),ROUND($S41*AD41*12*(1+$K$4)*((1+$T41)^COUNTA($U41:AC41)),0)))","v":""},""]
[null,7,"",null,null,null,"",{"$f":"IF($S42=\"\",\"\",IF(G59=\"\",ROUND($S42*V42*12*(1+$K$4),0),ROUND($S42*V42*12*(1+$K$4)*(1+$T42),0)))","v":""},{"$f":"IF($S42=\"\",\"\",IF(COUNTA($U42:V42)=0,ROUND($S42*W42*12*(1+$K$4),0),ROUND($S42*W42*12*(1+$K$4)*((1+$T42)^COUNTA($U42:V42)),0)))","v":""},{"$f":"IF($S42=\"\",\"\",IF(COUNTA($U42:W42)=0,ROUND($S42*X42*12*(1+$K$4),0),ROUND($S42*X42*12*(1+$K$4)*((1+$T42)^COUNTA($U42:W42)),0)))","v":""},{"$f":"IF($S42=\"\",\"\",IF(COUNTA($U42:X42)=0,ROUND($S42*Y42*12*(1+$K$4),0),ROUND($S42*Y42*12*(1+$K$4)*((1+$T42)^COUNTA($U42:X42)),0)))","v":""},{"$f":"IF($S42=\"\",\"\",IF(COUNTA($U42:Y42)=0,ROUND($S42*Z42*12*(1+$K$4),0),ROUND($S42*Z42*12*(1+$K$4)*((1+$T42)^COUNTA($U42:Y42)),0)))","v":""},{"$f":"IF($S42=\"\",\"\",IF(COUNTA($U42:Z42)=0,ROUND($S42*AA42*12*(1+$K$4),0),ROUND($S42*AA42*12*(1+$K$4)*((1+$T42)^COUNTA($U42:Z42)),0)))","v":""},{"$f":"IF($S42=\"\",\"\",IF(COUNTA($U42:AA42)=0,ROUND($S42*AB42*12*(1+$K$4),0),ROUND($S42*AB42*12*(1+$K$4)*((1+$T42)^COUNTA($U42:AA42)),0)))","v":""},{"$f":"IF($S42=\"\",\"\",IF(COUNTA($U42:AB42)=0,ROUND($S42*AC42*12*(1+$K$4),0),ROUND($S42*AC42*12*(1+$K$4)*((1+$T42)^COUNTA($U42:AB42)),0)))","v":""},{"$f":"IF($S42=\"\",\"\",IF(COUNTA($U42:AC42)=0,ROUND($S42*AD42*12*(1+$K$4),0),ROUND($S42*AD42*12*(1+$K$4)*((1+$T42)^COUNTA($U42:AC42)),0)))","v":""},""]
[null,8,"",null,null,null,"",{"$f":"IF($S43=\"\",\"\",IF(G60=\"\",ROUND($S43*V43*12*(1+$K$4),0),ROUND($S43*V43*12*(1+$K$4)*(1+$T43),0)))","v":""},{"$f":"IF($S43=\"\",\"\",IF(COUNTA($U43:V43)=0,ROUND($S43*W43*12*(1+$K$4),0),ROUND($S43*W43*12*(1+$K$4)*((1+$T43)^COUNTA($U43:V43)),0)))","v":""},{"$f":"IF($S43=\"\",\"\",IF(COUNTA($U43:W43)=0,ROUND($S43*X43*12*(1+$K$4),0),ROUND($S43*X43*12*(1+$K$4)*((1+$T43)^COUNTA($U43:W43)),0)))","v":""},{"$f":"IF($S43=\"\",\"\",IF(COUNTA($U43:X43)=0,ROUND($S43*Y43*12*(1+$K$4),0),ROUND($S43*Y43*12*(1+$K$4)*((1+$T43)^COUNTA($U43:X43)),0)))","v":""},{"$f":"IF($S43=\"\",\"\",IF(COUNTA($U43:Y43)=0,ROUND($S43*Z43*12*(1+$K$4),0),ROUND($S43*Z43*12*(1+$K$4)*((1+$T43)^COUNTA($U43:Y43)),0)))","v":""},{"$f":"IF($S43=\"\",\"\",IF(COUNTA($U43:Z43)=0,ROUND($S43*AA43*12*(1+$K$4),0),ROUND($S43*AA43*12*(1+$K$4)*((1+$T43)^COUNTA($U43:Z43)),0)))","v":""},{"$f":"IF($S43=\"\",\"\",IF(COUNTA($U43:AA43)=0,ROUND($S43*AB43*12*(1+$K$4),0),ROUND($S43*AB43*12*(1+$K$4)*((1+$T43)^COUNTA($U43:AA43)),0)))","v":""},{"$f":"IF($S43=\"\",\"\",IF(COUNTA($U43:AB43)=0,ROUND($S43*AC43*12*(1+$K$4),0),ROUND($S43*AC43*12*(1+$K$4)*((1+$T43)^COUNTA($U43:AB43)),0)))","v":""},{"$f":"IF($S43=\"\",\"\",IF(COUNTA($U43:AC43)=0,ROUND($S43*AD43*12*(1+$K$4),0),ROUND($S43*AD43*12*(1+$K$4)*((1+$T43)^COUNTA($U43:AC43)),0)))","v":""},""]
[null,9,"",null,null,null,"",{"$f":"IF($S44=\"\",\"\",IF(G61=\"\",ROUND($S44*V44*12*(1+$K$4),0),ROUND($S44*V44*12*(1+$K$4)*(1+$T44),0)))","v":""},{"$f":"IF($S44=\"\",\"\",IF(COUNTA($U44:V44)=0,ROUND($S44*W44*12*(1+$K$4),0),ROUND($S44*W44*12*(1+$K$4)*((1+$T44)^COUNTA($U44:V44)),0)))","v":""},{"$f":"IF($S44=\"\",\"\",IF(COUNTA($U44:W44)=0,ROUND($S44*X44*12*(1+$K$4),0),ROUND($S44*X44*12*(1+$K$4)*((1+$T44)^COUNTA($U44:W44)),0)))","v":""},{"$f":"IF($S44=\"\",\"\",IF(COUNTA($U44:X44)=0,ROUND($S44*Y44*12*(1+$K$4),0),ROUND($S44*Y44*12*(1+$K$4)*((1+$T44)^COUNTA($U44:X44)),0)))","v":""},{"$f":"IF($S44=\"\",\"\",IF(COUNTA($U44:Y44)=0,ROUND($S44*Z44*12*(1+$K$4),0),ROUND($S44*Z44*12*(1+$K$4)*((1+$T44)^COUNTA($U44:Y44)),0)))","v":""},{"$f":"IF($S44=\"\",\"\",IF(COUNTA($U44:Z44)=0,ROUND($S44*AA44*12*(1+$K$4),0),ROUND($S44*AA44*12*(1+$K$4)*((1+$T44)^COUNTA($U44:Z44)),0)))","v":""},{"$f":"IF($S44=\"\",\"\",IF(COUNTA($U44:AA44)=0,ROUND($S44*AB44*12*(1+$K$4),0),ROUND($S44*AB44*12*(1+$K$4)*((1+$T44)^COUNTA($U44:AA44)),0)))","v":""},{"$f":"IF($S44=\"\",\"\",IF(COUNTA($U44:AB44)=0,ROUND($S44*AC44*12*(1+$K$4),0),ROUND($S44*AC44*12*(1+$K$4)*((1+$T44)^COUNTA($U44:AB44)),0)))","v":""},{"$f":"IF($S44=\"\",\"\",IF(COUNTA($U44:AC44)=0,ROUND($S44*AD44*12*(1+$K$4),0),ROUND($S44*AD44*12*(1+$K$4)*((1+$T44)^COUNTA($U44:AC44)),0)))","v":""},""]
[null,10,"",null,null,null,"",{"$f":"IF($S45=\"\",\"\",IF(G62=\"\",ROUND($S45*V45*12*(1+$K$4),0),ROUND($S45*V45*12*(1+$K$4)*(1+$T45),0)))","v":""},{"$f":"IF($S45=\"\",\"\",IF(COUNTA($U45:V45)=0,ROUND($S45*W45*12*(1+$K$4),0),ROUND($S45*W45*12*(1+$K$4)*((1+$T45)^COUNTA($U45:V45)),0)))","v":""},{"$f":"IF($S45=\"\",\"\",IF(COUNTA($U45:W45)=0,ROUND($S45*X45*12*(1+$K$4),0),ROUND($S45*X45*12*(1+$K$4)*((1+$T45)^COUNTA($U45:W45)),0)))","v":""},{"$f":"IF($S45=\"\",\"\",IF(COUNTA($U45:X45)=0,ROUND($S45*Y45*12*(1+$K$4),0),ROUND($S45*Y45*12*(1+$K$4)*((1+$T45)^COUNTA($U45:X45)),0)))","v":""},{"$f":"IF($S45=\"\",\"\",IF(COUNTA($U45:Y45)=0,ROUND($S45*Z45*12*(1+$K$4),0),ROUND($S45*Z45*12*(1+$K$4)*((1+$T45)^COUNTA($U45:Y45)),0)))","v":""},{"$f":"IF($S45=\"\",\"\",IF(COUNTA($U45:Z45)=0,ROUND($S45*AA45*12*(1+$K$4),0),ROUND($S45*AA45*12*(1+$K$4)*((1+$T45)^COUNTA($U45:Z45)),0)))","v":""},{"$f":"IF($S45=\"\",\"\",IF(COUNTA($U45:AA45)=0,ROUND($S45*AB45*12*(1+$K$4),0),ROUND($S45*AB45*12*(1+$K$4)*((1+$T45)^COUNTA($U45:AA45)),0)))","v":""},{"$f":"IF($S45=\"\",\"\",IF(COUNTA($U45:AB45)=0,ROUND($S45*AC45*12*(1+$K$4),0),ROUND($S45*AC45*12*(1+$K$4)*((1+$T45)^COUNTA($U45:AB45)),0)))","v":""},{"$f":"IF($S45=\"\",\"\",IF(COUNTA($U45:AC45)=0,ROUND($S45*AD45*12*(1+$K$4),0),ROUND($S45*AD45*12*(1+$K$4)*((1+$T45)^COUNTA($U45:AC45)),0)))","v":""},""]
[null,11,"",null,null,null,"",{"$f":"IF($S46=\"\",\"\",IF(G63=\"\",ROUND($S46*V46*12*(1+$K$4),0),ROUND($S46*V46*12*(1+$K$4)*(1+$T46),0)))","v":""},{"$f":"IF($S46=\"\",\"\",IF(COUNTA($U46:V46)=0,ROUND($S46*W46*12*(1+$K$4),0),ROUND($S46*W46*12*(1+$K$4)*((1+$T46)^COUNTA($U46:V46)),0)))","v":""},{"$f":"IF($S46=\"\",\"\",IF(COUNTA($U46:W46)=0,ROUND($S46*X46*12*(1+$K$4),0),ROUND($S46*X46*12*(1+$K$4)*((1+$T46)^COUNTA($U46:W46)),0)))","v":""},{"$f":"IF($S46=\"\",\"\",IF(COUNTA($U46:X46)=0,ROUND($S46*Y46*12*(1+$K$4),0),ROUND($S46*Y46*12*(1+$K$4)*((1+$T46)^COUNTA($U46:X46)),0)))","v":""},{"$f":"IF($S46=\"\",\"\",IF(COUNTA($U46:Y46)=0,ROUND($S46*Z46*12*(1+$K$4),0),ROUND($S46*Z46*12*(1+$K$4)*((1+$T46)^COUNTA($U46:Y46)),0)))","v":""},{"$f":"IF($S46=\"\",\"\",IF(COUNTA($U46:Z46)=0,ROUND($S46*AA46*12*(1+$K$4),0),ROUND($S46*AA46*12*(1+$K$4)*((1+$T46)^COUNTA($U46:Z46)),0)))","v":""},{"$f":"IF($S46=\"\",\"\",IF(COUNTA($U46:AA46)=0,ROUND($S46*AB46*12*(1+$K$4),0),ROUND($S46*AB46*12*(1+$K$4)*((1+$T46)^COUNTA($U46:AA46)),0)))","v":""},{"$f":"IF($S46=\"\",\"\",IF(COUNTA($U46:AB46)=0,ROUND($S46*AC46*12*(1+$K$4),0),ROUND($S46*AC46*12*(1+$K$4)*((1+$T46)^COUNTA($U46:AB46)),0)))","v":""},{"$f":"IF($S46=\"\",\"\",IF(COUNTA($U46:AC46)=0,ROUND($S46*AD46*12*(1+$K$4),0),ROUND($S46*AD46*12*(1+$K$4)*((1+$T46)^COUNTA($U46:AC46)),0)))","v":""},""]
[null,12,"",null,null,null,"",{"$f":"IF($S47=\"\",\"\",IF(G64=\"\",ROUND($S47*V47*12*(1+$K$4),0),ROUND($S47*V47*12*(1+$K$4)*(1+$T47),0)))","v":""},{"$f":"IF($S47=\"\",\"\",IF(COUNTA($U47:V47)=0,ROUND($S47*W47*12*(1+$K$4),0),ROUND($S47*W47*12*(1+$K$4)*((1+$T47)^COUNTA($U47:V47)),0)))","v":""},{"$f":"IF($S47=\"\",\"\",IF(COUNTA($U47:W47)=0,ROUND($S47*X47*12*(1+$K$4),0),ROUND($S47*X47*12*(1+$K$4)*((1+$T47)^COUNTA($U47:W47)),0)))","v":""},{"$f":"IF($S47=\"\",\"\",IF(COUNTA($U47:X47)=0,ROUND($S47*Y47*12*(1+$K$4),0),ROUND($S47*Y47*12*(1+$K$4)*((1+$T47)^COUNTA($U47:X47)),0)))","v":""},{"$f":"IF($S47=\"\",\"\",IF(COUNTA($U47:Y47)=0,ROUND($S47*Z47*12*(1+$K$4),0),ROUND($S47*Z47*12*(1+$K$4)*((1+$T47)^COUNTA($U47:Y47)),0)))","v":""},{"$f":"IF($S47=\"\",\"\",IF(COUNTA($U47:Z47)=0,ROUND($S47*AA47*12*(1+$K$4),0),ROUND($S47*AA47*12*(1+$K$4)*((1+$T47)^COUNTA($U47:Z47)),0)))","v":""},{"$f":"IF($S47=\"\",\"\",IF(COUNTA($U47:AA47)=0,ROUND($S47*AB47*12*(1+$K$4),0),ROUND($S47*AB47*12*(1+$K$4)*((1+$T47)^COUNTA($U47:AA47)),0)))","v":""},{"$f":"IF($S47=\"\",\"\",IF(COUNTA($U47:AB47)=0,ROUND($S47*AC47*12*(1+$K$4),0),ROUND($S47*AC47*12*(1+$K$4)*((1+$T47)^COUNTA($U47:AB47)),0)))","v":""},{"$f":"IF($S47=\"\",\"\",IF(COUNTA($U47:AC47)=0,ROUND($S47*AD47*12*(1+$K$4),0),ROUND($S47*AD47*12*(1+$K$4)*((1+$T47)^COUNTA($U47:AC47)),0)))","v":""},""]
[null,13,"",null,null,null,"",{"$f":"IF($S48=\"\",\"\",IF(G65=\"\",ROUND($S48*V48*12*(1+$K$4),0),ROUND($S48*V48*12*(1+$K$4)*(1+$T48),0)))","v":""},{"$f":"IF($S48=\"\",\"\",IF(COUNTA($U48:V48)=0,ROUND($S48*W48*12*(1+$K$4),0),ROUND($S48*W48*12*(1+$K$4)*((1+$T48)^COUNTA($U48:V48)),0)))","v":""},{"$f":"IF($S48=\"\",\"\",IF(COUNTA($U48:W48)=0,ROUND($S48*X48*12*(1+$K$4),0),ROUND($S48*X48*12*(1+$K$4)*((1+$T48)^COUNTA($U48:W48)),0)))","v":""},{"$f":"IF($S48=\"\",\"\",IF(COUNTA($U48:X48)=0,ROUND($S48*Y48*12*(1+$K$4),0),ROUND($S48*Y48*12*(1+$K$4)*((1+$T48)^COUNTA($U48:X48)),0)))","v":""},{"$f":"IF($S48=\"\",\"\",IF(COUNTA($U48:Y48)=0,ROUND($S48*Z48*12*(1+$K$4),0),ROUND($S48*Z48*12*(1+$K$4)*((1+$T48)^COUNTA($U48:Y48)),0)))","v":""},{"$f":"IF($S48=\"\",\"\",IF(COUNTA($U48:Z48)=0,ROUND($S48*AA48*12*(1+$K$4),0),ROUND($S48*AA48*12*(1+$K$4)*((1+$T48)^COUNTA($U48:Z48)),0)))","v":""},{"$f":"IF($S48=\"\",\"\",IF(COUNTA($U48:AA48)=0,ROUND($S48*AB48*12*(1+$K$4),0),ROUND($S48*AB48*12*(1+$K$4)*((1+$T48)^COUNTA($U48:AA48)),0)))","v":""},{"$f":"IF($S48=\"\",\"\",IF(COUNTA($U48:AB48)=0,ROUND($S48*AC48*12*(1+$K$4),0),ROUND($S48*AC48*12*(1+$K$4)*((1+$T48)^COUNTA($U48:AB48)),0)))","v":""},{"$f":"IF($S48=\"\",\"\",IF(COUNTA($U48:AC48)=0,ROUND($S48*AD48*12*(1+$K$4),0),ROUND($S48*AD48*12*(1+$K$4)*((1+$T48)^COUNTA($U48:AC48)),0)))","v":""},""]
[null,14,"",null,null,null,"",{"$f":"IF($S49=\"\",\"\",IF(G66=\"\",ROUND($S49*V49*12*(1+$K$4),0),ROUND($S49*V49*12*(1+$K$4)*(1+$T49),0)))","v":""},{"$f":"IF($S49=\"\",\"\",IF(COUNTA($U49:V49)=0,ROUND($S49*W49*12*(1+$K$4),0),ROUND($S49*W49*12*(1+$K$4)*((1+$T49)^COUNTA($U49:V49)),0)))","v":""},{"$f":"IF($S49=\"\",\"\",IF(COUNTA($U49:W49)=0,ROUND($S49*X49*12*(1+$K$4),0),ROUND($S49*X49*12*(1+$K$4)*((1+$T49)^COUNTA($U49:W49)),0)))","v":""},{"$f":"IF($S49=\"\",\"\",IF(COUNTA($U49:X49)=0,ROUND($S49*Y49*12*(1+$K$4),0),ROUND($S49*Y49*12*(1+$K$4)*((1+$T49)^COUNTA($U49:X49)),0)))","v":""},{"$f":"IF($S49=\"\",\"\",IF(COUNTA($U49:Y49)=0,ROUND($S49*Z49*12*(1+$K$4),0),ROUND($S49*Z49*12*(1+$K$4)*((1+$T49)^COUNTA($U49:Y49)),0)))","v":""},{"$f":"IF($S49=\"\",\"\",IF(COUNTA($U49:Z49)=0,ROUND($S49*AA49*12*(1+$K$4),0),ROUND($S49*AA49*12*(1+$K$4)*((1+$T49)^COUNTA($U49:Z49)),0)))","v":""},{"$f":"IF($S49=\"\",\"\",IF(COUNTA($U49:AA49)=0,ROUND($S49*AB49*12*(1+$K$4),0),ROUND($S49*AB49*12*(1+$K$4)*((1+$T49)^COUNTA($U49:AA49)),0)))","v":""},{"$f":"IF($S49=\"\",\"\",IF(COUNTA($U49:AB49)=0,ROUND($S49*AC49*12*(1+$K$4),0),ROUND($S49*AC49*12*(1+$K$4)*((1+$T49)^COUNTA($U49:AB49)),0)))","v":""},{"$f":"IF($S49=\"\",\"\",IF(COUNTA($U49:AC49)=0,ROUND($S49*AD49*12*(1+$K$4),0),ROUND($S49*AD49*12*(1+$K$4)*((1+$T49)^COUNTA($U49:AC49)),0)))","v":""},""]
[null,15,{"$f":"IF(G50=\"\",\"\",G50)","v":""},null,null,null,{"$f":"IF(IF($S50=\"\",\"\",ROUND($S50*U50*12*(1+$K$4),0))=0,\"\",IF($S50=\"\",\"\",ROUND($S50*U50*12*(1+$K$4),0)))","v":""},{"$f":"IF($S50=\"\",\"\",IF(G67=\"\",ROUND($S50*V50*12*(1+$K$4),0),ROUND($S50*V50*12*(1+$K$4)*(1+$T50),0)))","v":""},{"$f":"IF($S50=\"\",\"\",IF(COUNTA($U50:V50)=0,ROUND($S50*W50*12*(1+$K$4),0),ROUND($S50*W50*12*(1+$K$4)*((1+$T50)^COUNTA($U50:V50)),0)))","v":""},{"$f":"IF($S50=\"\",\"\",IF(COUNTA($U50:W50)=0,ROUND($S50*X50*12*(1+$K$4),0),ROUND($S50*X50*12*(1+$K$4)*((1+$T50)^COUNTA($U50:W50)),0)))","v":""},{"$f":"IF($S50=\"\",\"\",IF(COUNTA($U50:X50)=0,ROUND($S50*Y50*12*(1+$K$4),0),ROUND($S50*Y50*12*(1+$K$4)*((1+$T50)^COUNTA($U50:X50)),0)))","v":""},{"$f":"IF($S50=\"\",\"\",IF(COUNTA($U50:Y50)=0,ROUND($S50*Z50*12*(1+$K$4),0),ROUND($S50*Z50*12*(1+$K$4)*((1+$T50)^COUNTA($U50:Y50)),0)))","v":""},{"$f":"IF($S50=\"\",\"\",IF(COUNTA($U50:Z50)=0,ROUND($S50*AA50*12*(1+$K$4),0),ROUND($S50*AA50*12*(1+$K$4)*((1+$T50)^COUNTA($U50:Z50)),0)))","v":""},{"$f":"IF($S50=\"\",\"\",IF(COUNTA($U50:AA50)=0,ROUND($S50*AB50*12*(1+$K$4),0),ROUND($S50*AB50*12*(1+$K$4)*((1+$T50)^COUNTA($U50:AA50)),0)))","v":""},{"$f":"IF($S50=\"\",\"\",IF(COUNTA($U50:AB50)=0,ROUND($S50*AC50*12*(1+$K$4),0),ROUND($S50*AC50*12*(1+$K$4)*((1+$T50)^COUNTA($U50:AB50)),0)))","v":""},{"$f":"IF($S50=\"\",\"\",IF(COUNTA($U50:AC50)=0,ROUND($S50*AD50*12*(1+$K$4),0),ROUND($S50*AD50*12*(1+$K$4)*((1+$T50)^COUNTA($U50:AC50)),0)))","v":""},""]
[null,"Totalt",null,null,null,null,{"$f":"IF(SUM(G53:G67)=0,\"\",SUM(G53:G67))","v":""},"","","","",{"$f":"IF(SUM(L53:L67)=0,\"\",SUM(L53:L67))","v":""},{"$f":"IF(SUM(M53:M67)=0,\"\",SUM(M53:M67))","v":""},{"$f":"IF(SUM(N53:N67)=0,\"\",SUM(N53:N67))","v":""},{"$f":"IF(SUM(O53:O67)=0,\"\",SUM(O53:O67))","v":""},{"$f":"IF(SUM(P53:P67)=0,\"\",SUM(P53:P67))","v":""},{"$f":"IF(SUM(Q53:Q67)=0,\"\",SUM(Q53:Q67))","v":""}]
[]
[null,"Lokaler",null,null,null,null,null,null,null,null,null,null,null,null,null,null,null,null,null,null,{"$f":"G$52","v":"Välj start år"},{"$f":"H$52","v":""},{"$f":"I$52","v":""},{"$f":"J$52","v":""},{"$f":"K$52","v":""},{"$f":"L$52","v":""},{"$f":"M$52","v":""},{"$f":"N$52","v":""},{"$f":"O$52","v":""},{"$f":"P$52","v":""}]
[null,null,"Typ av lokal",null,null,null,{"$f":"$D$6","v":0},{"$f":"G71+1","v":1},2,3,4,5,6,7,8,9,"Totalt",null,"Tot kostnad","Indexering","Förbr. %","Förbr. %","Förbr. %","Förbr. %","Förbr. %","Förbr. %","Förbr. %","Förbr. %","Förbr. %","Förbr. %"]
[null,1,null,null,null,null,{"$f":"IF($S72*U72*(1+$T72)=0,\"\",$S72*U72*(1+$T72))","v":""},{"$f":"IF($S72*V72*(1+$T72)=0,\"\",$S72*V72*(1+$T72))","v":""},{"$f":"IF($S72*W72*(1+$T72)=0,\"\",$S72*W72*(1+$T72))","v":""},{"$f":"IF($S72*X72*(1+$T72)=0,\"\",$S72*X72*(1+$T72))","v":""},{"$f":"IF($S72*Y72*(1+$T72)=0,\"\",$S72*Y72*(1+$T72))","v":""},{"$f":"IF($S72*Z72*(1+$T72)=0,\"\",$S72*Z72*(1+$T72))","v":""},{"$f":"IF($S72*AA72*(1+$T72)=0,\"\",$S72*AA72*(1+$T72))","v":""},{"$f":"IF($S72*AB72*(1+$T72)=0,\"\",$S72*AB72*(1+$T72))","v":""},{"$f":"IF($S72*AC72*(1+$T72)=0,\"\",$S72*AC72*(1+$T72))","v":""},{"$f":"IF($S72*AD72*(1+$T72)=0,\"\",$S72*AD72*(1+$T72))","v":""},{"$f":"IF(SUM(G72:P72)=0,\"\",SUM(G72:P72))","v":""},null,null,0]
[null,2,null,null,null,null,{"$f":"IF($S73*U73*(1+$T73)=0,\"\",$S73*U73*(1+$T73))","v":""},"","","","","","","","","",{"$f":"IF(SUM(G73:P73)=0,\"\",SUM(G73:P73))","v":""},null,null,0]
[null,3,null,null,null,null,"","","","","","","","","","","",null,null,0]
[null,4,null,null,null,null,"","","","","","","","","","","",null,null,0]
[null,5,null,null,null,null,"","","","","","","","","","","",null,null,0]
[null,"Totalt",null,null,null,null,{"$f":"IF(SUM(G72:G76)=0,\"\",SUM(G72:G76))","v":""},{"$f":"IF(SUM(H72:H76)=0,\"\",SUM(H72:H76))","v":""},"","","","","","","","",""]
[]
[null,"Driftkostnader",null,null,null,null,null,null,null,null,null,null,null,null,null,null,null,null,null,null,{"$f":"G$52","v":"Välj start år"},{"$f":"H$52","v":""},{"$f":"I$52","v":""},{"$f":"J$52","v":""},{"$f":"K$52","v":""},{"$f":"L$52","v":""},{"$f":"M$52","v":""},{"$f":"N$52","v":""},{"$f":"O$52","v":""},{"$f":"P$52","v":""}]
[null,null,"Driftkostnader","Beskrivning",null,null,{"$f":"$D$6","v":0},{"$f":"G80+1","v":1},2,3,4,5,6,7,8,9,"Totalt",null,"Tot kostnad","Indexering","Förbr. %","Förbr. %","Förbr. %","Förbr. %","Förbr. %","Förbr. %","Förbr. %","Förbr. %","Förbr. %","Förbr. %"]
[null,1,null,null,null,null,{"$f":"IF($S81*U81*(1+$T81)=0,\"\",$S81*U81*(1+$T81))","v":""},{"$f":"IF($S81*V81*(1+$T81)=0,\"\",$S81*V81*(1+$T81))","v":""},{"$f":"IF($S81*W81*(1+$T81)=0,\"\",$S81*W81*(1+$T81))","v":""},{"$f":"IF($S81*X81*(1+$T81)=0,\"\",$S81*X81*(1+$T81))","v":""},{"$f":"IF($S81*Y81*(1+$T81)=0,\"\",$S81*Y81*(1+$T81))","v":""},{"$f":"IF($S81*Z81*(1+$T81)=0,\"\",$S81*Z81*(1+$T81))","v":""},{"$f":"IF($S81*AA81*(1+$T81)=0,\"\",$S81*AA81*(1+$T81))","v":""},{"$f":"IF($S81*AB81*(1+$T81)=0,\"\",$S81*AB81*(1+$T81))","v":""},{"$f":"IF($S81*AC81*(1+$T81)=0,\"\",$S81*AC81*(1+$T81))","v":""},{"$f":"IF($S81*AD81*(1+$T81)=0,\"\",$S81*AD81*(1+$T81))","v":""},{"$f":"IF(SUM(G81:P81)=0,\"\",SUM(G81:P81))","v":""},null,null,0]
[null,2,null,null,null,null,{"$f":"IF($S82*U82*(1+$T82)=0,\"\",$S82*U82*(1+$T82))","v":""},"","","","","","","","","",{"$f":"IF(SUM(G82:P82)=0,\"\",SUM(G82:P82))","v":""},null,null,0]
[null,3,null,null,null,null,"","","","","","","","","","","",null,null,0]
[null,4,null,null,null,null,"","","","","","","","","","","",null,null,0]
[null,5,null,null,null,null,"","","","","","","","","","","",null,null,0]
[null,6,null,null,null,null,"","","","","","","","","","","",null,null,0]
[null,7,null,null,null,null,"","","","","","","","","","","",null,null,0]
[null,8,null,null,null,null,"","","","","","","","","","","",null,null,0]
[null,9,null,null,null,null,"","","","","","","","","","","",null,null,0]
[null,10,null,null,null,null,"","","","","","","","","","","",null,null,0]
[null,"INDI undantagna driftskostander"]
[null,11,null,null,null,null,{"$f":"IF($S92*U92*(1+$T92)=0,\"\",$S92*U92*(1+$T92))","v":""},{"$f":"IF($S92*V92*(1+$T92)=0,\"\",$S92*V92*(1+$T92))","v":""},{"$f":"IF($S92*W92*(1+$T92)=0,\"\",$S92*W92*(1+$T92))","v":""},{"$f":"IF($S92*X92*(1+$T92)=0,\"\",$S92*X92*(1+$T92))","v":""},{"$f":"IF($S92*Y92*(1+$T92)=0,\"\",$S92*Y92*(1+$T92))","v":""},{"$f":"IF($S92*Z92*(1+$T92)=0,\"\",$S92*Z92*(1+$T92))","v":""},{"$f":"IF($S92*AA92*(1+$T92)=0,\"\",$S92*AA92*(1+$T92))","v":""},{"$f":"IF($S92*AB92*(1+$T92)=0,\"\",$S92*AB92*(1+$T92))","v":""},{"$f":"IF($S92*AC92*(1+$T92)=0,\"\",$S92*AC92*(1+$T92))","v":""},{"$f":"IF($S92*AD92*(1+$T92)=0,\"\",$S92*AD92*(1+$T92))","v":""},"",null,null,0]
[null,12,null,null,null,null,"","","","","","","","","","","",null,null,0]
[null,13,null,null,null,null,"","","","","","","","","","","",null,null,0]
[null,14,null,null,null,null,"","","","","","","","","","","",null,null,0]
[null,15,null,null,null,null,"","","","","","","","","","","",null,null,0]
[null,"Totalt",null,null,null,null,{"$f":"IF(SUM(G81:G96)=0,\"\",SUM(G81:G96))","v":""},"","","",{"$f":"IF(SUM(K81:K96)=0,\"\",SUM(K81:K96))","v":""},{"$f":"IF(SUM(L81:L96)=0,\"\",SUM(L81:L96))","v":""},"","","","","",null,{"$f":"IF(SUM(S81:S96)=0,\"\",SUM(S81:S96))","v":""}]
[]
[null,"Avskrivningar utrustning",null,null,null,null,null,null,null,null,null,null,null,null,null,null,null,null,"Investeringsbudget",null,null,{"$f":"G$52","v":"Välj start år"},{"$f":"H$52","v":""},"","","","","","","",""]
[null,null,"Avskrivning","Beskrivning",null,null,{"$f":"$D$6","v":0},{"$f":"G100+1","v":1},2,3,4,5,6,7,8,9,"Totalt",null,"Inköpsvärde ","Inköpsår ","Avsk.tid","Omf %","Omf %","Omf %","Omf %","Omf %","Omf %","Omf %","Omf %","Omf %","Omf %"]
[null,1,null,null,null,null,{"$f":"IFERROR(IF(AND(G$100>=$T101,G$100<$T101+LEFT($U101,2)),($S101/LEFT($U101,2))*V101,IF(G$100>$T101+LEFT($U101,2),0,0)),\"\")","v":""},{"$f":"IFERROR(IF(AND(H$100>=$T101,H$100<$T101+LEFT($U101,2)),($S101/LEFT($U101,2))*W101,IF(H$100>$T101+LEFT($U101,2),0,0)),\"\")","v":""},"","","","","","","","",{"$f":"IF(SUM(G101:P101)=0,\"\",SUM(G101:P101))","v":""}]
[null,2,null,null,null,null,{"$f":"IFERROR(IF(AND(G$100>=$T102,G$100<$T102+LEFT($U102,2)),($S102/LEFT($U102,2))*V102,IF(G$100>$T102+LEFT($U102,2),0,0)),\"\")","v":""},"","","","","","","","","",{"$f":"IF(SUM(G102:P102)=0,\"\",SUM(G102:P102))","v":""}]
[null,3,null,null,null,null,"","","","","","","","","","",{"$f":"IF(SUM(G103:P103)=0,\"\",SUM(G103:P103))","v":""}]
[null,4,null,null,null,null,"","","","","","","","","","",""]
[null,5,null,null,null,null,"","","","","","","","","","",""]
[null,6,null,null,null,null,"","","","","","","","","","",""]
[null,7,null,null,null,null,"","","","","","","","","","",""]
[null,8,null,null,null,null,"","","","","","","","","","",""]
[null,9,null,null,null,null,"","","","","","","","","","",""]
[null,10,null,null,null,null,"","","","","","","","","","",""]
[null,"Totalt",null,null,null,null,{"$f":"IF(SUM(G101:G110)=0,\"\",SUM(G101:G110))","v":""},"","","",{"$f":"IF(SUM(K101:K110)=0,\"\",SUM(K101:K110))","v":""},{"$f":"IF(SUM(L101:L110)=0,\"\",SUM(L101:L110))","v":""},"","","","","",null,{"$f":"IF(SUM(S101:S110)=0,\"\",SUM(S101:S110))","v":""}]
[]
[null,"Total kostnad för projektet"]
[]
[null,"Total budget"]
[null,null,"Specifcierade kostander",null,null,null,{"$f":"$D$6","v":0},{"$f":"G116+1","v":1},2,3,4,5,6,7,8,9]
[null,1,"Löner inkl. sociala avgifter",null,null,null,{"$f":"G68","v":""},"","","","","","","","",""]
[null,2,"Driftskostander",null,null,null,{"$f":"G97","v":""},{"$f":"H97","v":""},"","","","","","","",""]
[null,3,"Avskrivningar utrustning",null,null,null,{"$f":"G111","v":""},{"$f":"H111","v":""},"","","","","","","",""]
[null,4,"Lokaler",null,null,null,{"$f":"G77","v":""},"","","","","","","","",""]
[null,5,"Delsumma",null,null,null,{"$f":"IF(SUM(G117:G120)=0,\"\",SUM(G117:G120))","v":""},{"$f":"IF(SUM(H117:H120)=0,\"\",SUM(H117:H120))","v":""},"","","","","","","",""]
[null,6,"Indirekta kostnader",null,null,null,{"$f":"IFERROR((G117+SUM(G81:G90))*($K$5),\"Välj institution\")","v":"Välj institution"},{"$f":"IFERROR((H117+SUM(H81:H90))*($K$5),\"Välj institution\")","v":"Välj institution"},"Välj institution","Välj institution","Välj institution","Välj institution","Välj institution","Välj institution","Välj institution","Välj institution"]
[null,7,"Total projektkostnad",null,null,null,{"$f":"IFERROR(G121+G122,\"\")","v":""},{"$f":"IFERROR(H121+H122,\"\")","v":""},"","","","","","","",""]
[null,null,null,null,null,null,"Totalt, sökt",null,null,"Annan kostnad",null,null,null,null,null,null,"Total kostnad"]
[null,1,"Löner inkl. sociala avgifter",null,null,null,{"$f":"SUM(G117:P117)","v":0},null,null,0,null,null,null,null,null,null,{"$f":"G125+J125","v":0}]
[null,2,"Driftskostander",null,null,null,{"$f":"SUM(G118:P118)","v":0},null,null,0,null,null,null,null,null,null,{"$f":"G126+J126","v":0}]
[null,3,"Avskrivningar utrustning",null,null,null,{"$f":"SUM(G119:P119)","v":0},null,null,0,null,null,null,null,null,null,{"$f":"G127+J127","v":0}]
[null,4,"Lokaler",null,null,null,0,null,null,0,null,null,null,null,null,null,{"$f":"G128+J128","v":0}]
[null,5,"Delsumma",null,null,null,0,null,null,0,null,null,null,null,null,null,{"$f":"G129+J129","v":0}]
[null,6,"Indirekta kostnader",null,null,null,{"$f":"IFERROR(SUM(G122:P122),\"Välj institution\")","v":0},null,null,{"$f":"IFERROR((J125+J126)*(1+$K$5),\"Välj institution\")","v":"Välj institution"},null,null,null,null,null,null,{"$f":"IFERROR(G130+J130,\"Välj institution\")","v":"Välj institution"}]
[null,7,"Total projektkostnad",null,null,null,{"$f":"IFERROR(G129+G130,\"Välj institution\")","v":0},null,null,{"$f":"IFERROR(J129+J130,\"Välj institution\")","v":"Välj institution"},null,null,null,null,null,null,{"$f":"IFERROR(G131+J131,\"Välj institution\")","v":"Välj institution"}]

{"sheet":"Inläsning UBW Planner","index":4,"n_rows":71,"n_cols":6,"rows_kept":71,"cut":false,"hidden":true,"merged":[]}
["Konto","Projekt","Start period","Slut period","Belopp","Text"]
[{"$f":"IF(C2=\"\",\"\",3511)","v":""},{"$f":"IF('Bidragsforskning VR (Prisma)'!$D$9=\"\",\"Ange projeknummer\",'Bidragsforskning VR (Prisma)'!$D$9)","v":"Ange projeknummer"},{"$f":"IF('Bidragsforskning VR (Prisma)'!$D$6<'Bidragsforskning VR (Prisma)'!$G$52,\"\",'Bidragsforskning VR (Prisma)'!$G$52&\"01\")","v":""},{"$f":"IF('Bidragsforskning VR (Prisma)'!$D$6<'Bidragsforskning VR (Prisma)'!$G$52,\"\",'Bidragsforskning VR (Prisma)'!$G$52&\"12\")","v":""},{"$f":"IFERROR(IF('Inläsning UBW Planner'!C2=\"\",\"\",ROUND('Bidragsforskning VR (Prisma)'!G$123,0))*-1,0)","v":0},{"$f":"\"Budget år \"&LEFT(C2,4)","v":"Budget år "}]
[4011,{"$f":"IF('Bidragsforskning VR (Prisma)'!$D$9=\"\",\"Ange projeknummer\",'Bidragsforskning VR (Prisma)'!$D$9)","v":"Ange projeknummer"},{"$f":"IF('Bidragsforskning VR (Prisma)'!$D$6<'Bidragsforskning VR (Prisma)'!$G$52,\"\",'Bidragsforskning VR (Prisma)'!$G$52&\"01\")","v":""},{"$f":"IF('Bidragsforskning VR (Prisma)'!$D$6<'Bidragsforskning VR (Prisma)'!$G$52,\"\",'Bidragsforskning VR (Prisma)'!$G$52&\"12\")","v":""},{"$f":"IFERROR(IF(C3=\"\",\"\",ROUND('Bidragsforskning VR (Prisma)'!G$117,0)),0)","v":""},{"$f":"\"Budget år \"&LEFT(C3,4)","v":"Budget år "}]
[50111,{"$f":"IF('Bidragsforskning VR (Prisma)'!$D$9=\"\",\"Ange projeknummer\",'Bidragsforskning VR (Prisma)'!$D$9)","v":"Ange projeknummer"},{"$f":"IF('Bidragsforskning VR (Prisma)'!$D$6<'Bidragsforskning VR (Prisma)'!$G$52,\"\",'Bidragsforskning VR (Prisma)'!$G$52&\"01\")","v":""},{"$f":"IF('Bidragsforskning VR (Prisma)'!$D$6<'Bidragsforskning VR (Prisma)'!$G$52,\"\",'Bidragsforskning VR (Prisma)'!$G$52&\"12\")","v":""},{"$f":"IFERROR(IF(C4=\"\",\"\",ROUND('Bidragsforskning VR (Prisma)'!G$120,0)),0)","v":""},"Budget år "]
[5871,{"$f":"IF('Bidragsforskning VR (Prisma)'!$D$9=\"\",\"Ange projeknummer\",'Bidragsforskning VR (Prisma)'!$D$9)","v":"Ange projeknummer"},{"$f":"IF('Bidragsforskning VR (Prisma)'!$D$6<'Bidragsforskning VR (Prisma)'!$G$52,\"\",'Bidragsforskning VR (Prisma)'!$G$52&\"01\")","v":""},{"$f":"IF('Bidragsforskning VR (Prisma)'!$D$6<'Bidragsforskning VR (Prisma)'!$G$52,\"\",'Bidragsforskning VR (Prisma)'!$G$52&\"12\")","v":""},{"$f":"IFERROR(IF(C5=\"\",\"\",ROUND(SUM('Bidragsforskning VR (Prisma)'!G$81:G$90),0)),0)","v":""},"Budget år "]
[57849,{"$f":"IF('Bidragsforskning VR (Prisma)'!$D$9=\"\",\"Ange projeknummer\",'Bidragsforskning VR (Prisma)'!$D$9)","v":"Ange projeknummer"},{"$f":"IF('Bidragsforskning VR (Prisma)'!$D$6<'Bidragsforskning VR (Prisma)'!$G$52,\"\",'Bidragsforskning VR (Prisma)'!$G$52&\"01\")","v":""},{"$f":"IF('Bidragsforskning VR (Prisma)'!$D$6<'Bidragsforskning VR (Prisma)'!$G$52,\"\",'Bidragsforskning VR (Prisma)'!$G$52&\"12\")","v":""},{"$f":"IFERROR(IF(C6=\"\",\"\",ROUND(SUM('Bidragsforskning VR (Prisma)'!G$92:G$96),0)),0)","v":""},"Budget år "]
[6911,{"$f":"IF('Bidragsforskning VR (Prisma)'!$D$9=\"\",\"Ange projeknummer\",'Bidragsforskning VR (Prisma)'!$D$9)","v":"Ange projeknummer"},{"$f":"IF('Bidragsforskning VR (Prisma)'!$D$6<'Bidragsforskning VR (Prisma)'!$G$52,\"\",'Bidragsforskning VR (Prisma)'!$G$52&\"01\")","v":""},{"$f":"IF('Bidragsforskning VR (Prisma)'!$D$6<'Bidragsforskning VR (Prisma)'!$G$52,\"\",'Bidragsforskning VR (Prisma)'!$G$52&\"12\")","v":""},{"$f":"IFERROR(IF(C7=\"\",\"\",ROUND('Bidragsforskning VR (Prisma)'!G$119,0)),0)","v":""},"Budget år "]
[49988,{"$f":"IF('Bidragsforskning VR (Prisma)'!$D$9=\"\",\"Ange projeknummer\",'Bidragsforskning VR (Prisma)'!$D$9)","v":"Ange projeknummer"},{"$f":"IF('Bidragsforskning VR (Prisma)'!$D$6<'Bidragsforskning VR (Prisma)'!$G$52,\"\",'Bidragsforskning VR (Prisma)'!$G$52&\"01\")","v":""},{"$f":"IF('Bidragsforskning VR (Prisma)'!$D$6<'Bidragsforskning VR (Prisma)'!$G$52,\"\",'Bidragsforskning VR (Prisma)'!$G$52&\"12\")","v":""},{"$f":"IFERROR(IF(C8=\"\",\"\",ROUND('Bidragsforskning VR (Prisma)'!G$122,0)),0)","v":""},"Budget år "]
[{"$f":"IF(C9=\"\",\"\",3511)","v":3511},{"$f":"IF(C9=\"\",\"\",IF('Bidragsforskning VR (Prisma)'!$D$9=\"\",\"Ange projeknummer\",'Bidragsforskning VR (Prisma)'!$D$9))","v":"Ange projeknummer"},{"$f":"IF('Bidragsforskning VR (Prisma)'!$D$7<'Bidragsforskning VR (Prisma)'!$H$52,\"\",'Bidragsforskning VR (Prisma)'!$H$52&\"01\")","v":"01"},{"$f":"IF('Bidragsforskning VR (Prisma)'!$D$7<'Bidragsforskning VR (Prisma)'!$H$52,\"\",'Bidragsforskning VR (Prisma)'!$H$52&\"12\")","v":"12"},{"$f":"IFERROR(IF('Inläsning UBW Planner'!C9=\"\",\"\",ROUND('Bidragsforskning VR (Prisma)'!H$123,0))*-1,0)","v":0},{"$f":"IF(C9=\"\",\"\",\"Budget år \"&LEFT(C9,4))","v":"Budget år 01"}]
[{"$f":"IF(C10=\"\",\"\",4011)","v":4011},{"$f":"IF(C10=\"\",\"\",IF('Bidragsforskning VR (Prisma)'!$D$9=\"\",\"Ange projeknummer\",'Bidragsforskning VR (Prisma)'!$D$9))","v":"Ange projeknummer"},{"$f":"IF('Bidragsforskning VR (Prisma)'!$D$7<'Bidragsforskning VR (Prisma)'!$H$52,\"\",'Bidragsforskning VR (Prisma)'!$H$52&\"01\")","v":"01"},{"$f":"IF('Bidragsforskning VR (Prisma)'!$D$7<'Bidragsforskning VR (Prisma)'!$H$52,\"\",'Bidragsforskning VR (Prisma)'!$H$52&\"12\")","v":"12"},{"$f":"IFERROR(IF(C10=\"\",\"\",ROUND('Bidragsforskning VR (Prisma)'!H$117,0)),0)","v":0},{"$f":"IF(C10=\"\",\"\",\"Budget år \"&LEFT(C10,4))","v":"Budget år 01"}]
[{"$f":"IF(C11=\"\",\"\",50111)","v":50111},{"$f":"IF(C11=\"\",\"\",IF('Bidragsforskning VR (Prisma)'!$D$9=\"\",\"Ange projeknummer\",'Bidragsforskning VR (Prisma)'!$D$9))","v":"Ange projeknummer"},{"$f":"IF('Bidragsforskning VR (Prisma)'!$D$7<'Bidragsforskning VR (Prisma)'!$H$52,\"\",'Bidragsforskning VR (Prisma)'!$H$52&\"01\")","v":"01"},{"$f":"IF('Bidragsforskning VR (Prisma)'!$D$7<'Bidragsforskning VR (Prisma)'!$H$52,\"\",'Bidragsforskning VR (Prisma)'!$H$52&\"12\")","v":"12"},{"$f":"IFERROR(IF(C11=\"\",\"\",ROUND('Bidragsforskning VR (Prisma)'!H$120,0)),0)","v":0},"Budget år 01"]
[{"$f":"IF(C12=\"\",\"\",5871)","v":5871},{"$f":"IF(C12=\"\",\"\",IF('Bidragsforskning VR (Prisma)'!$D$9=\"\",\"Ange projeknummer\",'Bidragsforskning VR (Prisma)'!$D$9))","v":"Ange projeknummer"},{"$f":"IF('Bidragsforskning VR (Prisma)'!$D$7<'Bidragsforskning VR (Prisma)'!$H$52,\"\",'Bidragsforskning VR (Prisma)'!$H$52&\"01\")","v":"01"},{"$f":"IF('Bidragsforskning VR (Prisma)'!$D$7<'Bidragsforskning VR (Prisma)'!$H$52,\"\",'Bidragsforskning VR (Prisma)'!$H$52&\"12\")","v":"12"},{"$f":"IFERROR(IF(C12=\"\",\"\",ROUND(SUM('Bidragsforskning VR (Prisma)'!H$81:H$90),0)),0)","v":0},"Budget år 01"]
[{"$f":"IF(C13=\"\",\"\",57849)","v":57849},{"$f":"IF(C13=\"\",\"\",IF('Bidragsforskning VR (Prisma)'!$D$9=\"\",\"Ange projeknummer\",'Bidragsforskning VR (Prisma)'!$D$9))","v":"Ange projeknummer"},{"$f":"IF('Bidragsforskning VR (Prisma)'!$D$7<'Bidragsforskning VR (Prisma)'!$H$52,\"\",'Bidragsforskning VR (Prisma)'!$H$52&\"01\")","v":"01"},{"$f":"IF('Bidragsforskning VR (Prisma)'!$D$7<'Bidragsforskning VR (Prisma)'!$H$52,\"\",'Bidragsforskning VR (Prisma)'!$H$52&\"12\")","v":"12"},{"$f":"IFERROR(IF(C13=\"\",\"\",ROUND(SUM('Bidragsforskning VR (Prisma)'!H$92:H$96),0)),0)","v":0},"Budget år 01"]
[{"$f":"IF(C14=\"\",\"\",6911)","v":6911},{"$f":"IF(C14=\"\",\"\",IF('Bidragsforskning VR (Prisma)'!$D$9=\"\",\"Ange projeknummer\",'Bidragsforskning VR (Prisma)'!$D$9))","v":"Ange projeknummer"},{"$f":"IF('Bidragsforskning VR (Prisma)'!$D$7<'Bidragsforskning VR (Prisma)'!$H$52,\"\",'Bidragsforskning VR (Prisma)'!$H$52&\"01\")","v":"01"},{"$f":"IF('Bidragsforskning VR (Prisma)'!$D$7<'Bidragsforskning VR (Prisma)'!$H$52,\"\",'Bidragsforskning VR (Prisma)'!$H$52&\"12\")","v":"12"},{"$f":"IFERROR(IF(C14=\"\",\"\",ROUND('Bidragsforskning VR (Prisma)'!H$119,0)),0)","v":0},"Budget år 01"]
[{"$f":"IF(C15=\"\",\"\",49988)","v":49988},{"$f":"IF(C15=\"\",\"\",IF('Bidragsforskning VR (Prisma)'!$D$9=\"\",\"Ange projeknummer\",'Bidragsforskning VR (Prisma)'!$D$9))","v":"Ange projeknummer"},{"$f":"IF('Bidragsforskning VR (Prisma)'!$D$7<'Bidragsforskning VR (Prisma)'!$H$52,\"\",'Bidragsforskning VR (Prisma)'!$H$52&\"01\")","v":"01"},{"$f":"IF('Bidragsforskning VR (Prisma)'!$D$7<'Bidragsforskning VR (Prisma)'!$H$52,\"\",'Bidragsforskning VR (Prisma)'!$H$52&\"12\")","v":"12"},{"$f":"IFERROR(IF(C15=\"\",\"\",ROUND('Bidragsforskning VR (Prisma)'!H$122,0)),0)","v":0},"Budget år 01"]
[{"$f":"IF(C16=\"\",\"\",3511)","v":3511},{"$f":"IF(C16=\"\",\"\",IF('Bidragsforskning VR (Prisma)'!$D$9=\"\",\"Ange projeknummer\",'Bidragsforskning VR (Prisma)'!$D$9))","v":"Ange projeknummer"},{"$f":"IF('Bidragsforskning VR (Prisma)'!$D$7<'Bidragsforskning VR (Prisma)'!$I$52,\"\",'Bidragsforskning VR (Prisma)'!$I$52&\"01\")","v":"01"},{"$f":"IF('Bidragsforskning VR (Prisma)'!$D$7<'Bidragsforskning VR (Prisma)'!$I$52,\"\",'Bidragsforskning VR (Prisma)'!$I$52&\"12\")","v":"12"},{"$f":"IFERROR(IF(IF('Inläsning UBW Planner'!C16=\"\",\"\",ROUND('Bidragsforskning VR (Prisma)'!I$123,0))*-1=0,0,IF('Inläsning UBW Planner'!C16=\"\",\"\",ROUND('Bidragsforskning VR (Prisma)'!I$123,0))*-1),0)","v":0},{"$f":"IF(C16=\"\",\"\",\"Budget år \"&LEFT(C16,4))","v":"Budget år 01"}]
[{"$f":"IF(C17=\"\",\"\",4011)","v":4011},{"$f":"IF(C17=\"\",\"\",IF('Bidragsforskning VR (Prisma)'!$D$9=\"\",\"Ange projeknummer\",'Bidragsforskning VR (Prisma)'!$D$9))","v":"Ange projeknummer"},{"$f":"IF('Bidragsforskning VR (Prisma)'!$D$7<'Bidragsforskning VR (Prisma)'!$I$52,\"\",'Bidragsforskning VR (Prisma)'!$I$52&\"01\")","v":"01"},{"$f":"IF('Bidragsforskning VR (Prisma)'!$D$7<'Bidragsforskning VR (Prisma)'!$I$52,\"\",'Bidragsforskning VR (Prisma)'!$I$52&\"12\")","v":"12"},{"$f":"IFERROR(IF(C17=\"\",\"\",ROUND('Bidragsforskning VR (Prisma)'!I$117,0)),0)","v":0},{"$f":"IF(C17=\"\",\"\",\"Budget år \"&LEFT(C17,4))","v":"Budget år 01"}]
[{"$f":"IF(C18=\"\",\"\",50111)","v":50111},{"$f":"IF(C18=\"\",\"\",IF('Bidragsforskning VR (Prisma)'!$D$9=\"\",\"Ange projeknummer\",'Bidragsforskning VR (Prisma)'!$D$9))","v":"Ange projeknummer"},{"$f":"IF('Bidragsforskning VR (Prisma)'!$D$7<'Bidragsforskning VR (Prisma)'!$I$52,\"\",'Bidragsforskning VR (Prisma)'!$I$52&\"01\")","v":"01"},{"$f":"IF('Bidragsforskning VR (Prisma)'!$D$7<'Bidragsforskning VR (Prisma)'!$I$52,\"\",'Bidragsforskning VR (Prisma)'!$I$52&\"12\")","v":"12"},{"$f":"IFERROR(IF(C18=\"\",\"\",ROUND('Bidragsforskning VR (Prisma)'!I$120,0)),0)","v":0},"Budget år 01"]
[{"$f":"IF(C19=\"\",\"\",5871)","v":5871},{"$f":"IF(C19=\"\",\"\",IF('Bidragsforskning VR (Prisma)'!$D$9=\"\",\"Ange projeknummer\",'Bidragsforskning VR (Prisma)'!$D$9))","v":"Ange projeknummer"},{"$f":"IF('Bidragsforskning VR (Prisma)'!$D$7<'Bidragsforskning VR (Prisma)'!$I$52,\"\",'Bidragsforskning VR (Prisma)'!$I$52&\"01\")","v":"01"},{"$f":"IF('Bidragsforskning VR (Prisma)'!$D$7<'Bidragsforskning VR (Prisma)'!$I$52,\"\",'Bidragsforskning VR (Prisma)'!$I$52&\"12\")","v":"12"},{"$f":"IFERROR(IF(C19=\"\",\"\",ROUND(SUM('Bidragsforskning VR (Prisma)'!I$81:I$90),0)),0)","v":0},"Budget år 01"]
[{"$f":"IF(C20=\"\",\"\",57849)","v":57849},{"$f":"IF(C20=\"\",\"\",IF('Bidragsforskning VR (Prisma)'!$D$9=\"\",\"Ange projeknummer\",'Bidragsforskning VR (Prisma)'!$D$9))","v":"Ange projeknummer"},{"$f":"IF('Bidragsforskning VR (Prisma)'!$D$7<'Bidragsforskning VR (Prisma)'!$I$52,\"\",'Bidragsforskning VR (Prisma)'!$I$52&\"01\")","v":"01"},{"$f":"IF('Bidragsforskning VR (Prisma)'!$D$7<'Bidragsforskning VR (Prisma)'!$I$52,\"\",'Bidragsforskning VR (Prisma)'!$I$52&\"12\")","v":"12"},{"$f":"IFERROR(IF(C20=\"\",\"\",ROUND(SUM('Bidragsforskning VR (Prisma)'!I$92:I$96),0)),0)","v":0},"Budget år 01"]
[{"$f":"IF(C21=\"\",\"\",6911)","v":6911},{"$f":"IF(C21=\"\",\"\",IF('Bidragsforskning VR (Prisma)'!$D$9=\"\",\"Ange projeknummer\",'Bidragsforskning VR (Prisma)'!$D$9))","v":"Ange projeknummer"},{"$f":"IF('Bidragsforskning VR (Prisma)'!$D$7<'Bidragsforskning VR (Prisma)'!$I$52,\"\",'Bidragsforskning VR (Prisma)'!$I$52&\"01\")","v":"01"},{"$f":"IF('Bidragsforskning VR (Prisma)'!$D$7<'Bidragsforskning VR (Prisma)'!$I$52,\"\",'Bidragsforskning VR (Prisma)'!$I$52&\"12\")","v":"12"},{"$f":"IFERROR(IF(C21=\"\",\"\",ROUND('Bidragsforskning VR (Prisma)'!I$119,0)),0)","v":0},"Budget år 01"]
[{"$f":"IF(C22=\"\",\"\",49988)","v":49988},{"$f":"IF(C22=\"\",\"\",IF('Bidragsforskning VR (Prisma)'!$D$9=\"\",\"Ange projeknummer\",'Bidragsforskning VR (Prisma)'!$D$9))","v":"Ange projeknummer"},{"$f":"IF('Bidragsforskning VR (Prisma)'!$D$7<'Bidragsforskning VR (Prisma)'!$I$52,\"\",'Bidragsforskning VR (Prisma)'!$I$52&\"01\")","v":"01"},{"$f":"IF('Bidragsforskning VR (Prisma)'!$D$7<'Bidragsforskning VR (Prisma)'!$I$52,\"\",'Bidragsforskning VR (Prisma)'!$I$52&\"12\")","v":"12"},{"$f":"IFERROR(IF(C22=\"\",\"\",ROUND('Bidragsforskning VR (Prisma)'!I$122,0)),0)","v":0},"Budget år 01"]
[{"$f":"IF(C23=\"\",\"\",3511)","v":3511},{"$f":"IF(C23=\"\",\"\",IF('Bidragsforskning VR (Prisma)'!$D$9=\"\",\"Ange projeknummer\",'Bidragsforskning VR (Prisma)'!$D$9))","v":"Ange projeknummer"},{"$f":"IF('Bidragsforskning VR (Prisma)'!$D$7<'Bidragsforskning VR (Prisma)'!$J$52,\"\",'Bidragsforskning VR (Prisma)'!$J$52&\"01\")","v":"01"},{"$f":"IF('Bidragsforskning VR (Prisma)'!$D$7<'Bidragsforskning VR (Prisma)'!$J$52,\"\",'Bidragsforskning VR (Prisma)'!$J$52&\"12\")","v":"12"},{"$f":"IFERROR(IF(IF('Inläsning UBW Planner'!C23=\"\",\"\",ROUND('Bidragsforskning VR (Prisma)'!J$123,0))*-1=0,0,IF('Inläsning UBW Planner'!C23=\"\",\"\",ROUND('Bidragsforskning VR (Prisma)'!J$123,0))*-1),0)","v":0},{"$f":"IF(C23=\"\",\"\",\"Budget år \"&LEFT(C23,4))","v":"Budget år 01"}]
[{"$f":"IF(C24=\"\",\"\",4011)","v":4011},{"$f":"IF(C24=\"\",\"\",IF('Bidragsforskning VR (Prisma)'!$D$9=\"\",\"Ange projeknummer\",'Bidragsforskning VR (Prisma)'!$D$9))","v":"Ange projeknummer"},{"$f":"IF('Bidragsforskning VR (Prisma)'!$D$7<'Bidragsforskning VR (Prisma)'!$J$52,\"\",'Bidragsforskning VR (Prisma)'!$J$52&\"01\")","v":"01"},{"$f":"IF('Bidragsforskning VR (Prisma)'!$D$7<'Bidragsforskning VR (Prisma)'!$J$52,\"\",'Bidragsforskning VR (Prisma)'!$J$52&\"12\")","v":"12"},{"$f":"IFERROR(IF(C24=\"\",\"\",ROUND('Bidragsforskning VR (Prisma)'!J$117,0)),0)","v":0},{"$f":"IF(C24=\"\",\"\",\"Budget år \"&LEFT(C24,4))","v":"Budget år 01"}]
[{"$f":"IF(C25=\"\",\"\",50111)","v":50111},{"$f":"IF(C25=\"\",\"\",IF('Bidragsforskning VR (Prisma)'!$D$9=\"\",\"Ange projeknummer\",'Bidragsforskning VR (Prisma)'!$D$9))","v":"Ange projeknummer"},{"$f":"IF('Bidragsforskning VR (Prisma)'!$D$7<'Bidragsforskning VR (Prisma)'!$J$52,\"\",'Bidragsforskning VR (Prisma)'!$J$52&\"01\")","v":"01"},{"$f":"IF('Bidragsforskning VR (Prisma)'!$D$7<'Bidragsforskning VR (Prisma)'!$J$52,\"\",'Bidragsforskning VR (Prisma)'!$J$52&\"12\")","v":"12"},{"$f":"IFERROR(IF(C25=\"\",\"\",ROUND('Bidragsforskning VR (Prisma)'!J$120,0)),0)","v":0},"Budget år 01"]
[{"$f":"IF(C26=\"\",\"\",5871)","v":5871},{"$f":"IF(C26=\"\",\"\",IF('Bidragsforskning VR (Prisma)'!$D$9=\"\",\"Ange projeknummer\",'Bidragsforskning VR (Prisma)'!$D$9))","v":"Ange projeknummer"},{"$f":"IF('Bidragsforskning VR (Prisma)'!$D$7<'Bidragsforskning VR (Prisma)'!$J$52,\"\",'Bidragsforskning VR (Prisma)'!$J$52&\"01\")","v":"01"},{"$f":"IF('Bidragsforskning VR (Prisma)'!$D$7<'Bidragsforskning VR (Prisma)'!$J$52,\"\",'Bidragsforskning VR (Prisma)'!$J$52&\"12\")","v":"12"},{"$f":"IFERROR(IF(C26=\"\",\"\",ROUND(SUM('Bidragsforskning VR (Prisma)'!J$81:J$90),0)),0)","v":0},"Budget år 01"]
[{"$f":"IF(C27=\"\",\"\",57849)","v":57849},{"$f":"IF(C27=\"\",\"\",IF('Bidragsforskning VR (Prisma)'!$D$9=\"\",\"Ange projeknummer\",'Bidragsforskning VR (Prisma)'!$D$9))","v":"Ange projeknummer"},{"$f":"IF('Bidragsforskning VR (Prisma)'!$D$7<'Bidragsforskning VR (Prisma)'!$J$52,\"\",'Bidragsforskning VR (Prisma)'!$J$52&\"01\")","v":"01"},{"$f":"IF('Bidragsforskning VR (Prisma)'!$D$7<'Bidragsforskning VR (Prisma)'!$J$52,\"\",'Bidragsforskning VR (Prisma)'!$J$52&\"12\")","v":"12"},{"$f":"IFERROR(IF(C27=\"\",\"\",ROUND(SUM('Bidragsforskning VR (Prisma)'!J$92:J$96),0)),0)","v":0},"Budget år 01"]
[{"$f":"IF(C28=\"\",\"\",6911)","v":6911},{"$f":"IF(C28=\"\",\"\",IF('Bidragsforskning VR (Prisma)'!$D$9=\"\",\"Ange projeknummer\",'Bidragsforskning VR (Prisma)'!$D$9))","v":"Ange projeknummer"},{"$f":"IF('Bidragsforskning VR (Prisma)'!$D$7<'Bidragsforskning VR (Prisma)'!$J$52,\"\",'Bidragsforskning VR (Prisma)'!$J$52&\"01\")","v":"01"},{"$f":"IF('Bidragsforskning VR (Prisma)'!$D$7<'Bidragsforskning VR (Prisma)'!$J$52,\"\",'Bidragsforskning VR (Prisma)'!$J$52&\"12\")","v":"12"},{"$f":"IFERROR(IF(C28=\"\",\"\",ROUND('Bidragsforskning VR (Prisma)'!J$119,0)),0)","v":0},"Budget år 01"]
[{"$f":"IF(C29=\"\",\"\",49988)","v":49988},{"$f":"IF(C29=\"\",\"\",IF('Bidragsforskning VR (Prisma)'!$D$9=\"\",\"Ange projeknummer\",'Bidragsforskning VR (Prisma)'!$D$9))","v":"Ange projeknummer"},{"$f":"IF('Bidragsforskning VR (Prisma)'!$D$7<'Bidragsforskning VR (Prisma)'!$J$52,\"\",'Bidragsforskning VR (Prisma)'!$J$52&\"01\")","v":"01"},{"$f":"IF('Bidragsforskning VR (Prisma)'!$D$7<'Bidragsforskning VR (Prisma)'!$J$52,\"\",'Bidragsforskning VR (Prisma)'!$J$52&\"12\")","v":"12"},{"$f":"IFERROR(IF(C29=\"\",\"\",ROUND('Bidragsforskning VR (Prisma)'!J$122,0)),0)","v":0},"Budget år 01"]
[{"$f":"IF(C30=\"\",\"\",3511)","v":3511},{"$f":"IF(C30=\"\",\"\",IF('Bidragsforskning VR (Prisma)'!$D$9=\"\",\"Ange projeknummer\",'Bidragsforskning VR (Prisma)'!$D$9))","v":"Ange projeknummer"},{"$f":"IF('Bidragsforskning VR (Prisma)'!$D$7<'Bidragsforskning VR (Prisma)'!$K$52,\"\",'Bidragsforskning VR (Prisma)'!$K$52&\"01\")","v":"01"},{"$f":"IF('Bidragsforskning VR (Prisma)'!$D$7<'Bidragsforskning VR (Prisma)'!$K$52,\"\",'Bidragsforskning VR (Prisma)'!$K$52&\"12\")","v":"12"},{"$f":"IFERROR(IF(IF('Inläsning UBW Planner'!C30=\"\",\"\",ROUND('Bidragsforskning VR (Prisma)'!K$123,0))*-1=0,0,IF('Inläsning UBW Planner'!C30=\"\",\"\",ROUND('Bidragsforskning VR (Prisma)'!K$123,0))*-1),0)","v":0},{"$f":"IF(C30=\"\",\"\",\"Budget år \"&LEFT(C30,4))","v":"Budget år 01"}]
[{"$f":"IF(C31=\"\",\"\",4011)","v":4011},{"$f":"IF(C31=\"\",\"\",IF('Bidragsforskning VR (Prisma)'!$D$9=\"\",\"Ange projeknummer\",'Bidragsforskning VR (Prisma)'!$D$9))","v":"Ange projeknummer"},{"$f":"IF('Bidragsforskning VR (Prisma)'!$D$7<'Bidragsforskning VR (Prisma)'!$K$52,\"\",'Bidragsforskning VR (Prisma)'!$K$52&\"01\")","v":"01"},{"$f":"IF('Bidragsforskning VR (Prisma)'!$D$7<'Bidragsforskning VR (Prisma)'!$K$52,\"\",'Bidragsforskning VR (Prisma)'!$K$52&\"12\")","v":"12"},{"$f":"IFERROR(IF(C31=\"\",\"\",ROUND('Bidragsforskning VR (Prisma)'!K$117,0)),0)","v":0},{"$f":"IF(C31=\"\",\"\",\"Budget år \"&LEFT(C31,4))","v":"Budget år 01"}]
[{"$f":"IF(C32=\"\",\"\",50111)","v":50111},{"$f":"IF(C32=\"\",\"\",IF('Bidragsforskning VR (Prisma)'!$D$9=\"\",\"Ange projeknummer\",'Bidragsforskning VR (Prisma)'!$D$9))","v":"Ange projeknummer"},{"$f":"IF('Bidragsforskning VR (Prisma)'!$D$7<'Bidragsforskning VR (Prisma)'!$K$52,\"\",'Bidragsforskning VR (Prisma)'!$K$52&\"01\")","v":"01"},{"$f":"IF('Bidragsforskning VR (Prisma)'!$D$7<'Bidragsforskning VR (Prisma)'!$K$52,\"\",'Bidragsforskning VR (Prisma)'!$K$52&\"12\")","v":"12"},{"$f":"IFERROR(IF(C32=\"\",\"\",ROUND('Bidragsforskning VR (Prisma)'!K$120,0)),0)","v":0},"Budget år 01"]
[{"$f":"IF(C33=\"\",\"\",5871)","v":5871},{"$f":"IF(C33=\"\",\"\",IF('Bidragsforskning VR (Prisma)'!$D$9=\"\",\"Ange projeknummer\",'Bidragsforskning VR (Prisma)'!$D$9))","v":"Ange projeknummer"},{"$f":"IF('Bidragsforskning VR (Prisma)'!$D$7<'Bidragsforskning VR (Prisma)'!$K$52,\"\",'Bidragsforskning VR (Prisma)'!$K$52&\"01\")","v":"01"},{"$f":"IF('Bidragsforskning VR (Prisma)'!$D$7<'Bidragsforskning VR (Prisma)'!$K$52,\"\",'Bidragsforskning VR (Prisma)'!$K$52&\"12\")","v":"12"},{"$f":"IFERROR(IF(C33=\"\",\"\",ROUND(SUM('Bidragsforskning VR (Prisma)'!K$81:K$90),0)),0)","v":0},"Budget år 01"]
[{"$f":"IF(C34=\"\",\"\",57849)","v":57849},{"$f":"IF(C34=\"\",\"\",IF('Bidragsforskning VR (Prisma)'!$D$9=\"\",\"Ange projeknummer\",'Bidragsforskning VR (Prisma)'!$D$9))","v":"Ange projeknummer"},{"$f":"IF('Bidragsforskning VR (Prisma)'!$D$7<'Bidragsforskning VR (Prisma)'!$K$52,\"\",'Bidragsforskning VR (Prisma)'!$K$52&\"01\")","v":"01"},{"$f":"IF('Bidragsforskning VR (Prisma)'!$D$7<'Bidragsforskning VR (Prisma)'!$K$52,\"\",'Bidragsforskning VR (Prisma)'!$K$52&\"12\")","v":"12"},{"$f":"IFERROR(IF(C34=\"\",\"\",ROUND(SUM('Bidragsforskning VR (Prisma)'!K$92:K$96),0)),0)","v":0},"Budget år 01"]
[{"$f":"IF(C35=\"\",\"\",6911)","v":6911},{"$f":"IF(C35=\"\",\"\",IF('Bidragsforskning VR (Prisma)'!$D$9=\"\",\"Ange projeknummer\",'Bidragsforskning VR (Prisma)'!$D$9))","v":"Ange projeknummer"},{"$f":"IF('Bidragsforskning VR (Prisma)'!$D$7<'Bidragsforskning VR (Prisma)'!$K$52,\"\",'Bidragsforskning VR (Prisma)'!$K$52&\"01\")","v":"01"},{"$f":"IF('Bidragsforskning VR (Prisma)'!$D$7<'Bidragsforskning VR (Prisma)'!$K$52,\"\",'Bidragsforskning VR (Prisma)'!$K$52&\"12\")","v":"12"},{"$f":"IFERROR(IF(C35=\"\",\"\",ROUND('Bidragsforskning VR (Prisma)'!K$119,0)),0)","v":0},"Budget år 01"]
[{"$f":"IF(C36=\"\",\"\",49988)","v":49988},{"$f":"IF(C36=\"\",\"\",IF('Bidragsforskning VR (Prisma)'!$D$9=\"\",\"Ange projeknummer\",'Bidragsforskning VR (Prisma)'!$D$9))","v":"Ange projeknummer"},{"$f":"IF('Bidragsforskning VR (Prisma)'!$D$7<'Bidragsforskning VR (Prisma)'!$K$52,\"\",'Bidragsforskning VR (Prisma)'!$K$52&\"01\")","v":"01"},{"$f":"IF('Bidragsforskning VR (Prisma)'!$D$7<'Bidragsforskning VR (Prisma)'!$K$52,\"\",'Bidragsforskning VR (Prisma)'!$K$52&\"12\")","v":"12"},{"$f":"IFERROR(IF(C36=\"\",\"\",ROUND('Bidragsforskning VR (Prisma)'!K$122,0)),0)","v":0},"Budget år 01"]
[{"$f":"IF(C37=\"\",\"\",3511)","v":3511},{"$f":"IF(C37=\"\",\"\",IF('Bidragsforskning VR (Prisma)'!$D$9=\"\",\"Ange projeknummer\",'Bidragsforskning VR (Prisma)'!$D$9))","v":"Ange projeknummer"},{"$f":"IF('Bidragsforskning VR (Prisma)'!$D$7<'Bidragsforskning VR (Prisma)'!$L$52,\"\",'Bidragsforskning VR (Prisma)'!$L$52&\"01\")","v":"01"},{"$f":"IF('Bidragsforskning VR (Prisma)'!$D$7<'Bidragsforskning VR (Prisma)'!$L$52,\"\",'Bidragsforskning VR (Prisma)'!$L$52&\"12\")","v":"12"},{"$f":"IFERROR(IF(IF('Inläsning UBW Planner'!C37=\"\",\"\",ROUND('Bidragsforskning VR (Prisma)'!L$123,0))*-1=0,0,IF('Inläsning UBW Planner'!C37=\"\",\"\",ROUND('Bidragsforskning VR (Prisma)'!L$123,0))*-1),0)","v":0},{"$f":"IF(C37=\"\",\"\",\"Budget år \"&LEFT(C37,4))","v":"Budget år 01"}]
[{"$f":"IF(C38=\"\",\"\",4011)","v":4011},{"$f":"IF(C38=\"\",\"\",IF('Bidragsforskning VR (Prisma)'!$D$9=\"\",\"Ange projeknummer\",'Bidragsforskning VR (Prisma)'!$D$9))","v":"Ange projeknummer"},{"$f":"IF('Bidragsforskning VR (Prisma)'!$D$7<'Bidragsforskning VR (Prisma)'!$L$52,\"\",'Bidragsforskning VR (Prisma)'!$L$52&\"01\")","v":"01"},{"$f":"IF('Bidragsforskning VR (Prisma)'!$D$7<'Bidragsforskning VR (Prisma)'!$L$52,\"\",'Bidragsforskning VR (Prisma)'!$L$52&\"12\")","v":"12"},{"$f":"IFERROR(IF(C38=\"\",\"\",ROUND('Bidragsforskning VR (Prisma)'!L$117,0)),0)","v":0},{"$f":"IF(C38=\"\",\"\",\"Budget år \"&LEFT(C38,4))","v":"Budget år 01"}]
[{"$f":"IF(C39=\"\",\"\",50111)","v":50111},{"$f":"IF(C39=\"\",\"\",IF('Bidragsforskning VR (Prisma)'!$D$9=\"\",\"Ange projeknummer\",'Bidragsforskning VR (Prisma)'!$D$9))","v":"Ange projeknummer"},{"$f":"IF('Bidragsforskning VR (Prisma)'!$D$7<'Bidragsforskning VR (Prisma)'!$L$52,\"\",'Bidragsforskning VR (Prisma)'!$L$52&\"01\")","v":"01"},{"$f":"IF('Bidragsforskning VR (Prisma)'!$D$7<'Bidragsforskning VR (Prisma)'!$L$52,\"\",'Bidragsforskning VR (Prisma)'!$L$52&\"12\")","v":"12"},{"$f":"IFERROR(IF(C39=\"\",\"\",ROUND('Bidragsforskning VR (Prisma)'!L$120,0)),0)","v":0},"Budget år 01"]
[{"$f":"IF(C40=\"\",\"\",5871)","v":5871},{"$f":"IF(C40=\"\",\"\",IF('Bidragsforskning VR (Prisma)'!$D$9=\"\",\"Ange projeknummer\",'Bidragsforskning VR (Prisma)'!$D$9))","v":"Ange projeknummer"},{"$f":"IF('Bidragsforskning VR (Prisma)'!$D$7<'Bidragsforskning VR (Prisma)'!$L$52,\"\",'Bidragsforskning VR (Prisma)'!$L$52&\"01\")","v":"01"},{"$f":"IF('Bidragsforskning VR (Prisma)'!$D$7<'Bidragsforskning VR (Prisma)'!$L$52,\"\",'Bidragsforskning VR (Prisma)'!$L$52&\"12\")","v":"12"},{"$f":"IFERROR(IF(C40=\"\",\"\",ROUND(SUM('Bidragsforskning VR (Prisma)'!L$81:L$90),0)),0)","v":0},"Budget år 01"]
[{"$f":"IF(C41=\"\",\"\",57849)","v":57849},{"$f":"IF(C41=\"\",\"\",IF('Bidragsforskning VR (Prisma)'!$D$9=\"\",\"Ange projeknummer\",'Bidragsforskning VR (Prisma)'!$D$9))","v":"Ange projeknummer"},{"$f":"IF('Bidragsforskning VR (Prisma)'!$D$7<'Bidragsforskning VR (Prisma)'!$L$52,\"\",'Bidragsforskning VR (Prisma)'!$L$52&\"01\")","v":"01"},{"$f":"IF('Bidragsforskning VR (Prisma)'!$D$7<'Bidragsforskning VR (Prisma)'!$L$52,\"\",'Bidragsforskning VR (Prisma)'!$L$52&\"12\")","v":"12"},{"$f":"IFERROR(IF(C41=\"\",\"\",ROUND(SUM('Bidragsforskning VR (Prisma)'!L$92:L$96),0)),0)","v":0},"Budget år 01"]
[{"$f":"IF(C42=\"\",\"\",6911)","v":6911},{"$f":"IF(C42=\"\",\"\",IF('Bidragsforskning VR (Prisma)'!$D$9=\"\",\"Ange projeknummer\",'Bidragsforskning VR (Prisma)'!$D$9))","v":"Ange projeknummer"},{"$f":"IF('Bidragsforskning VR (Prisma)'!$D$7<'Bidragsforskning VR (Prisma)'!$L$52,\"\",'Bidragsforskning VR (Prisma)'!$L$52&\"01\")","v":"01"},{"$f":"IF('Bidragsforskning VR (Prisma)'!$D$7<'Bidragsforskning VR (Prisma)'!$L$52,\"\",'Bidragsforskning VR (Prisma)'!$L$52&\"12\")","v":"12"},{"$f":"IFERROR(IF(C42=\"\",\"\",ROUND('Bidragsforskning VR (Prisma)'!L$119,0)),0)","v":0},"Budget år 01"]
[{"$f":"IF(C43=\"\",\"\",49988)","v":49988},{"$f":"IF(C43=\"\",\"\",IF('Bidragsforskning VR (Prisma)'!$D$9=\"\",\"Ange projeknummer\",'Bidragsforskning VR (Prisma)'!$D$9))","v":"Ange projeknummer"},{"$f":"IF('Bidragsforskning VR (Prisma)'!$D$7<'Bidragsforskning VR (Prisma)'!$L$52,\"\",'Bidragsforskning VR (Prisma)'!$L$52&\"01\")","v":"01"},{"$f":"IF('Bidragsforskning VR (Prisma)'!$D$7<'Bidragsforskning VR (Prisma)'!$L$52,\"\",'Bidragsforskning VR (Prisma)'!$L$52&\"12\")","v":"12"},{"$f":"IFERROR(IF(C43=\"\",\"\",ROUND('Bidragsforskning VR (Prisma)'!L$122,0)),0)","v":0},"Budget år 01"]
[{"$f":"IF(C44=\"\",\"\",3511)","v":3511},{"$f":"IF(C44=\"\",\"\",IF('Bidragsforskning VR (Prisma)'!$D$9=\"\",\"Ange projeknummer\",'Bidragsforskning VR (Prisma)'!$D$9))","v":"Ange projeknummer"},{"$f":"IF('Bidragsforskning VR (Prisma)'!$D$7<'Bidragsforskning VR (Prisma)'!$M$52,\"\",'Bidragsforskning VR (Prisma)'!$M$52&\"01\")","v":"01"},{"$f":"IF('Bidragsforskning VR (Prisma)'!$D$7<'Bidragsforskning VR (Prisma)'!$M$52,\"\",'Bidragsforskning VR (Prisma)'!$M$52&\"12\")","v":"12"},{"$f":"IFERROR(IF(IF('Inläsning UBW Planner'!C44=\"\",\"\",ROUND('Bidragsforskning VR (Prisma)'!M$123,0))*-1=0,0,IF('Inläsning UBW Planner'!C44=\"\",\"\",ROUND('Bidragsforskning VR (Prisma)'!M$123,0))*-1),\"\")","v":""},{"$f":"IF(C44=\"\",\"\",\"Budget år \"&LEFT(C44,4))","v":"Budget år 01"}]
[{"$f":"IF(C45=\"\",\"\",4011)","v":4011},{"$f":"IF(C45=\"\",\"\",IF('Bidragsforskning VR (Prisma)'!$D$9=\"\",\"Ange projeknummer\",'Bidragsforskning VR (Prisma)'!$D$9))","v":"Ange projeknummer"},{"$f":"IF('Bidragsforskning VR (Prisma)'!$D$7<'Bidragsforskning VR (Prisma)'!$M$52,\"\",'Bidragsforskning VR (Prisma)'!$M$52&\"01\")","v":"01"},{"$f":"IF('Bidragsforskning VR (Prisma)'!$D$7<'Bidragsforskning VR (Prisma)'!$M$52,\"\",'Bidragsforskning VR (Prisma)'!$M$52&\"12\")","v":"12"},{"$f":"IFERROR(IF(C45=\"\",\"\",ROUND('Bidragsforskning VR (Prisma)'!M$117,0)),0)","v":0},{"$f":"IF(C45=\"\",\"\",\"Budget år \"&LEFT(C45,4))","v":"Budget år 01"}]
[{"$f":"IF(C46=\"\",\"\",50111)","v":50111},{"$f":"IF(C46=\"\",\"\",IF('Bidragsforskning VR (Prisma)'!$D$9=\"\",\"Ange projeknummer\",'Bidragsforskning VR (Prisma)'!$D$9))","v":"Ange projeknummer"},{"$f":"IF('Bidragsforskning VR (Prisma)'!$D$7<'Bidragsforskning VR (Prisma)'!$M$52,\"\",'Bidragsforskning VR (Prisma)'!$M$52&\"01\")","v":"01"},{"$f":"IF('Bidragsforskning VR (Prisma)'!$D$7<'Bidragsforskning VR (Prisma)'!$M$52,\"\",'Bidragsforskning VR (Prisma)'!$M$52&\"12\")","v":"12"},{"$f":"IFERROR(IF(C46=\"\",\"\",ROUND('Bidragsforskning VR (Prisma)'!M$120,0)),0)","v":0},"Budget år 01"]
[{"$f":"IF(C47=\"\",\"\",5871)","v":5871},{"$f":"IF(C47=\"\",\"\",IF('Bidragsforskning VR (Prisma)'!$D$9=\"\",\"Ange projeknummer\",'Bidragsforskning VR (Prisma)'!$D$9))","v":"Ange projeknummer"},{"$f":"IF('Bidragsforskning VR (Prisma)'!$D$7<'Bidragsforskning VR (Prisma)'!$M$52,\"\",'Bidragsforskning VR (Prisma)'!$M$52&\"01\")","v":"01"},{"$f":"IF('Bidragsforskning VR (Prisma)'!$D$7<'Bidragsforskning VR (Prisma)'!$M$52,\"\",'Bidragsforskning VR (Prisma)'!$M$52&\"12\")","v":"12"},{"$f":"IFERROR(IF(C47=\"\",\"\",ROUND(SUM('Bidragsforskning VR (Prisma)'!M$81:M$90),0)),0)","v":0},"Budget år 01"]
[{"$f":"IF(C48=\"\",\"\",57849)","v":57849},{"$f":"IF(C48=\"\",\"\",IF('Bidragsforskning VR (Prisma)'!$D$9=\"\",\"Ange projeknummer\",'Bidragsforskning VR (Prisma)'!$D$9))","v":"Ange projeknummer"},{"$f":"IF('Bidragsforskning VR (Prisma)'!$D$7<'Bidragsforskning VR (Prisma)'!$M$52,\"\",'Bidragsforskning VR (Prisma)'!$M$52&\"01\")","v":"01"},{"$f":"IF('Bidragsforskning VR (Prisma)'!$D$7<'Bidragsforskning VR (Prisma)'!$M$52,\"\",'Bidragsforskning VR (Prisma)'!$M$52&\"12\")","v":"12"},{"$f":"IFERROR(IF(C48=\"\",\"\",ROUND(SUM('Bidragsforskning VR (Prisma)'!M$92:M$96),0)),0)","v":0},"Budget år 01"]
[{"$f":"IF(C49=\"\",\"\",6911)","v":6911},{"$f":"IF(C49=\"\",\"\",IF('Bidragsforskning VR (Prisma)'!$D$9=\"\",\"Ange projeknummer\",'Bidragsforskning VR (Prisma)'!$D$9))","v":"Ange projeknummer"},{"$f":"IF('Bidragsforskning VR (Prisma)'!$D$7<'Bidragsforskning VR (Prisma)'!$M$52,\"\",'Bidragsforskning VR (Prisma)'!$M$52&\"01\")","v":"01"},{"$f":"IF('Bidragsforskning VR (Prisma)'!$D$7<'Bidragsforskning VR (Prisma)'!$M$52,\"\",'Bidragsforskning VR (Prisma)'!$M$52&\"12\")","v":"12"},{"$f":"IFERROR(IF(C49=\"\",\"\",ROUND('Bidragsforskning VR (Prisma)'!M$119,0)),0)","v":0},"Budget år 01"]
[{"$f":"IF(C50=\"\",\"\",49988)","v":49988},{"$f":"IF(C50=\"\",\"\",IF('Bidragsforskning VR (Prisma)'!$D$9=\"\",\"Ange projeknummer\",'Bidragsforskning VR (Prisma)'!$D$9))","v":"Ange projeknummer"},{"$f":"IF('Bidragsforskning VR (Prisma)'!$D$7<'Bidragsforskning VR (Prisma)'!$M$52,\"\",'Bidragsforskning VR (Prisma)'!$M$52&\"01\")","v":"01"},{"$f":"IF('Bidragsforskning VR (Prisma)'!$D$7<'Bidragsforskning VR (Prisma)'!$M$52,\"\",'Bidragsforskning VR (Prisma)'!$M$52&\"12\")","v":"12"},{"$f":"IFERROR(IF(C50=\"\",\"\",ROUND('Bidragsforskning VR (Prisma)'!M$122,0)),0)","v":0},"Budget år 01"]
[{"$f":"IF(C51=\"\",\"\",3511)","v":3511},{"$f":"IF(C51=\"\",\"\",IF('Bidragsforskning VR (Prisma)'!$D$9=\"\",\"Ange projeknummer\",'Bidragsforskning VR (Prisma)'!$D$9))","v":"Ange projeknummer"},{"$f":"IF('Bidragsforskning VR (Prisma)'!$D$7<'Bidragsforskning VR (Prisma)'!$N$52,\"\",'Bidragsforskning VR (Prisma)'!$N$52&\"01\")","v":"01"},{"$f":"IF('Bidragsforskning VR (Prisma)'!$D$7<'Bidragsforskning VR (Prisma)'!$N$52,\"\",'Bidragsforskning VR (Prisma)'!$N$52&\"12\")","v":"12"},{"$f":"IFERROR(IF(IF('Inläsning UBW Planner'!C51=\"\",\"\",ROUND('Bidragsforskning VR (Prisma)'!N$123,0))*-1=0,0,IF('Inläsning UBW Planner'!C51=\"\",\"\",ROUND('Bidragsforskning VR (Prisma)'!N$123,0))*-1),\"\")","v":""},{"$f":"IF(C51=\"\",\"\",\"Budget år \"&LEFT(C51,4))","v":"Budget år 01"}]
[{"$f":"IF(C52=\"\",\"\",4011)","v":4011},{"$f":"IF(C52=\"\",\"\",IF('Bidragsforskning VR (Prisma)'!$D$9=\"\",\"Ange projeknummer\",'Bidragsforskning VR (Prisma)'!$D$9))","v":"Ange projeknummer"},{"$f":"IF('Bidragsforskning VR (Prisma)'!$D$7<'Bidragsforskning VR (Prisma)'!$N$52,\"\",'Bidragsforskning VR (Prisma)'!$N$52&\"01\")","v":"01"},{"$f":"IF('Bidragsforskning VR (Prisma)'!$D$7<'Bidragsforskning VR (Prisma)'!$N$52,\"\",'Bidragsforskning VR (Prisma)'!$N$52&\"12\")","v":"12"},{"$f":"IFERROR(IF(C52=\"\",\"\",ROUND('Bidragsforskning VR (Prisma)'!N$117,0)),0)","v":0},{"$f":"IF(C52=\"\",\"\",\"Budget år \"&LEFT(C52,4))","v":"Budget år 01"}]
[{"$f":"IF(C53=\"\",\"\",50111)","v":50111},{"$f":"IF(C53=\"\",\"\",IF('Bidragsforskning VR (Prisma)'!$D$9=\"\",\"Ange projeknummer\",'Bidragsforskning VR (Prisma)'!$D$9))","v":"Ange projeknummer"},{"$f":"IF('Bidragsforskning VR (Prisma)'!$D$7<'Bidragsforskning VR (Prisma)'!$N$52,\"\",'Bidragsforskning VR (Prisma)'!$N$52&\"01\")","v":"01"},{"$f":"IF('Bidragsforskning VR (Prisma)'!$D$7<'Bidragsforskning VR (Prisma)'!$N$52,\"\",'Bidragsforskning VR (Prisma)'!$N$52&\"12\")","v":"12"},{"$f":"IFERROR(IF(C53=\"\",\"\",ROUND('Bidragsforskning VR (Prisma)'!N$120,0)),0)","v":0},"Budget år 01"]
[{"$f":"IF(C54=\"\",\"\",5871)","v":5871},{"$f":"IF(C54=\"\",\"\",IF('Bidragsforskning VR (Prisma)'!$D$9=\"\",\"Ange projeknummer\",'Bidragsforskning VR (Prisma)'!$D$9))","v":"Ange projeknummer"},{"$f":"IF('Bidragsforskning VR (Prisma)'!$D$7<'Bidragsforskning VR (Prisma)'!$N$52,\"\",'Bidragsforskning VR (Prisma)'!$N$52&\"01\")","v":"01"},{"$f":"IF('Bidragsforskning VR (Prisma)'!$D$7<'Bidragsforskning VR (Prisma)'!$N$52,\"\",'Bidragsforskning VR (Prisma)'!$N$52&\"12\")","v":"12"},{"$f":"IFERROR(IF(C54=\"\",\"\",ROUND(SUM('Bidragsforskning VR (Prisma)'!N$81:N$90),0)),0)","v":0},"Budget år 01"]
[{"$f":"IF(C55=\"\",\"\",57849)","v":57849},{"$f":"IF(C55=\"\",\"\",IF('Bidragsforskning VR (Prisma)'!$D$9=\"\",\"Ange projeknummer\",'Bidragsforskning VR (Prisma)'!$D$9))","v":"Ange projeknummer"},{"$f":"IF('Bidragsforskning VR (Prisma)'!$D$7<'Bidragsforskning VR (Prisma)'!$N$52,\"\",'Bidragsforskning VR (Prisma)'!$N$52&\"01\")","v":"01"},{"$f":"IF('Bidragsforskning VR (Prisma)'!$D$7<'Bidragsforskning VR (Prisma)'!$N$52,\"\",'Bidragsforskning VR (Prisma)'!$N$52&\"12\")","v":"12"},{"$f":"IFERROR(IF(C55=\"\",\"\",ROUND(SUM('Bidragsforskning VR (Prisma)'!N$92:N$96),0)),0)","v":0},"Budget år 01"]
[{"$f":"IF(C56=\"\",\"\",6911)","v":6911},{"$f":"IF(C56=\"\",\"\",IF('Bidragsforskning VR (Prisma)'!$D$9=\"\",\"Ange projeknummer\",'Bidragsforskning VR (Prisma)'!$D$9))","v":"Ange projeknummer"},{"$f":"IF('Bidragsforskning VR (Prisma)'!$D$7<'Bidragsforskning VR (Prisma)'!$N$52,\"\",'Bidragsforskning VR (Prisma)'!$N$52&\"01\")","v":"01"},{"$f":"IF('Bidragsforskning VR (Prisma)'!$D$7<'Bidragsforskning VR (Prisma)'!$N$52,\"\",'Bidragsforskning VR (Prisma)'!$N$52&\"12\")","v":"12"},{"$f":"IFERROR(IF(C56=\"\",\"\",ROUND('Bidragsforskning VR (Prisma)'!N$119,0)),0)","v":0},"Budget år 01"]
[{"$f":"IF(C57=\"\",\"\",49988)","v":49988},{"$f":"IF(C57=\"\",\"\",IF('Bidragsforskning VR (Prisma)'!$D$9=\"\",\"Ange projeknummer\",'Bidragsforskning VR (Prisma)'!$D$9))","v":"Ange projeknummer"},{"$f":"IF('Bidragsforskning VR (Prisma)'!$D$7<'Bidragsforskning VR (Prisma)'!$N$52,\"\",'Bidragsforskning VR (Prisma)'!$N$52&\"01\")","v":"01"},{"$f":"IF('Bidragsforskning VR (Prisma)'!$D$7<'Bidragsforskning VR (Prisma)'!$N$52,\"\",'Bidragsforskning VR (Prisma)'!$N$52&\"12\")","v":"12"},{"$f":"IFERROR(IF(C57=\"\",\"\",ROUND('Bidragsforskning VR (Prisma)'!N$122,0)),0)","v":0},"Budget år 01"]
[{"$f":"IF(C58=\"\",\"\",3511)","v":3511},{"$f":"IF(C58=\"\",\"\",IF('Bidragsforskning VR (Prisma)'!$D$9=\"\",\"Ange projeknummer\",'Bidragsforskning VR (Prisma)'!$D$9))","v":"Ange projeknummer"},{"$f":"IF('Bidragsforskning VR (Prisma)'!$D$7<'Bidragsforskning VR (Prisma)'!$O$52,\"\",'Bidragsforskning VR (Prisma)'!$O$52&\"01\")","v":"01"},{"$f":"IF('Bidragsforskning VR (Prisma)'!$D$7<'Bidragsforskning VR (Prisma)'!$O$52,\"\",'Bidragsforskning VR (Prisma)'!$O$52&\"12\")","v":"12"},{"$f":"IFERROR(IF(IF('Inläsning UBW Planner'!C58=\"\",\"\",ROUND('Bidragsforskning VR (Prisma)'!O$123,0))*-1=0,0,IF('Inläsning UBW Planner'!C58=\"\",\"\",ROUND('Bidragsforskning VR (Prisma)'!O$123,0))*-1),\"\")","v":""},{"$f":"IF(C58=\"\",\"\",\"Budget år \"&LEFT(C58,4))","v":"Budget år 01"}]
[{"$f":"IF(C59=\"\",\"\",4011)","v":4011},{"$f":"IF(C59=\"\",\"\",IF('Bidragsforskning VR (Prisma)'!$D$9=\"\",\"Ange projeknummer\",'Bidragsforskning VR (Prisma)'!$D$9))","v":"Ange projeknummer"},{"$f":"IF('Bidragsforskning VR (Prisma)'!$D$7<'Bidragsforskning VR (Prisma)'!$O$52,\"\",'Bidragsforskning VR (Prisma)'!$O$52&\"01\")","v":"01"},{"$f":"IF('Bidragsforskning VR (Prisma)'!$D$7<'Bidragsforskning VR (Prisma)'!$O$52,\"\",'Bidragsforskning VR (Prisma)'!$O$52&\"12\")","v":"12"},{"$f":"IFERROR(IF(C59=\"\",\"\",ROUND('Bidragsforskning VR (Prisma)'!O$117,0)),0)","v":0},{"$f":"IF(C59=\"\",\"\",\"Budget år \"&LEFT(C59,4))","v":"Budget år 01"}]
[{"$f":"IF(C60=\"\",\"\",50111)","v":50111},{"$f":"IF(C60=\"\",\"\",IF('Bidragsforskning VR (Prisma)'!$D$9=\"\",\"Ange projeknummer\",'Bidragsforskning VR (Prisma)'!$D$9))","v":"Ange projeknummer"},{"$f":"IF('Bidragsforskning VR (Prisma)'!$D$7<'Bidragsforskning VR (Prisma)'!$O$52,\"\",'Bidragsforskning VR (Prisma)'!$O$52&\"01\")","v":"01"},{"$f":"IF('Bidragsforskning VR (Prisma)'!$D$7<'Bidragsforskning VR (Prisma)'!$O$52,\"\",'Bidragsforskning VR (Prisma)'!$O$52&\"12\")","v":"12"},{"$f":"IFERROR(IF(C60=\"\",\"\",ROUND('Bidragsforskning VR (Prisma)'!O$120,0)),0)","v":0},"Budget år 01"]
[{"$f":"IF(C61=\"\",\"\",5871)","v":5871},{"$f":"IF(C61=\"\",\"\",IF('Bidragsforskning VR (Prisma)'!$D$9=\"\",\"Ange projeknummer\",'Bidragsforskning VR (Prisma)'!$D$9))","v":"Ange projeknummer"},{"$f":"IF('Bidragsforskning VR (Prisma)'!$D$7<'Bidragsforskning VR (Prisma)'!$O$52,\"\",'Bidragsforskning VR (Prisma)'!$O$52&\"01\")","v":"01"},{"$f":"IF('Bidragsforskning VR (Prisma)'!$D$7<'Bidragsforskning VR (Prisma)'!$O$52,\"\",'Bidragsforskning VR (Prisma)'!$O$52&\"12\")","v":"12"},{"$f":"IFERROR(IF(C61=\"\",\"\",ROUND(SUM('Bidragsforskning VR (Prisma)'!O$81:O$90),0)),0)","v":0},"Budget år 01"]
[{"$f":"IF(C62=\"\",\"\",57849)","v":57849},{"$f":"IF(C62=\"\",\"\",IF('Bidragsforskning VR (Prisma)'!$D$9=\"\",\"Ange projeknummer\",'Bidragsforskning VR (Prisma)'!$D$9))","v":"Ange projeknummer"},{"$f":"IF('Bidragsforskning VR (Prisma)'!$D$7<'Bidragsforskning VR (Prisma)'!$O$52,\"\",'Bidragsforskning VR (Prisma)'!$O$52&\"01\")","v":"01"},{"$f":"IF('Bidragsforskning VR (Prisma)'!$D$7<'Bidragsforskning VR (Prisma)'!$O$52,\"\",'Bidragsforskning VR (Prisma)'!$O$52&\"12\")","v":"12"},{"$f":"IFERROR(IF(C62=\"\",\"\",ROUND(SUM('Bidragsforskning VR (Prisma)'!O$92:O$96),0)),0)","v":0},"Budget år 01"]
[{"$f":"IF(C63=\"\",\"\",6911)","v":6911},{"$f":"IF(C63=\"\",\"\",IF('Bidragsforskning VR (Prisma)'!$D$9=\"\",\"Ange projeknummer\",'Bidragsforskning VR (Prisma)'!$D$9))","v":"Ange projeknummer"},{"$f":"IF('Bidragsforskning VR (Prisma)'!$D$7<'Bidragsforskning VR (Prisma)'!$O$52,\"\",'Bidragsforskning VR (Prisma)'!$O$52&\"01\")","v":"01"},{"$f":"IF('Bidragsforskning VR (Prisma)'!$D$7<'Bidragsforskning VR (Prisma)'!$O$52,\"\",'Bidragsforskning VR (Prisma)'!$O$52&\"12\")","v":"12"},{"$f":"IFERROR(IF(C63=\"\",\"\",ROUND('Bidragsforskning VR (Prisma)'!O$119,0)),0)","v":0},"Budget år 01"]
[{"$f":"IF(C64=\"\",\"\",49988)","v":49988},{"$f":"IF(C64=\"\",\"\",IF('Bidragsforskning VR (Prisma)'!$D$9=\"\",\"Ange projeknummer\",'Bidragsforskning VR (Prisma)'!$D$9))","v":"Ange projeknummer"},{"$f":"IF('Bidragsforskning VR (Prisma)'!$D$7<'Bidragsforskning VR (Prisma)'!$O$52,\"\",'Bidragsforskning VR (Prisma)'!$O$52&\"01\")","v":"01"},{"$f":"IF('Bidragsforskning VR (Prisma)'!$D$7<'Bidragsforskning VR (Prisma)'!$O$52,\"\",'Bidragsforskning VR (Prisma)'!$O$52&\"12\")","v":"12"},{"$f":"IFERROR(IF(C64=\"\",\"\",ROUND('Bidragsforskning VR (Prisma)'!O$122,0)),0)","v":0},"Budget år 01"]
[{"$f":"IF(C65=\"\",\"\",3511)","v":3511},{"$f":"IF(C65=\"\",\"\",IF('Bidragsforskning VR (Prisma)'!$D$9=\"\",\"Ange projeknummer\",'Bidragsforskning VR (Prisma)'!$D$9))","v":"Ange projeknummer"},{"$f":"IF('Bidragsforskning VR (Prisma)'!$D$7<'Bidragsforskning VR (Prisma)'!$P$52,\"\",'Bidragsforskning VR (Prisma)'!$P$52&\"01\")","v":"01"},{"$f":"IF('Bidragsforskning VR (Prisma)'!$D$7<'Bidragsforskning VR (Prisma)'!$P$52,\"\",'Bidragsforskning VR (Prisma)'!$P$52&\"12\")","v":"12"},{"$f":"IFERROR(IF(IF('Inläsning UBW Planner'!C65=\"\",\"\",ROUND('Bidragsforskning VR (Prisma)'!P$123,0))*-1=0,0,IF('Inläsning UBW Planner'!C65=\"\",\"\",ROUND('Bidragsforskning VR (Prisma)'!P$123,0))*-1),\"\")","v":""},{"$f":"IF(C65=\"\",\"\",\"Budget år \"&LEFT(C65,4))","v":"Budget år 01"}]
[{"$f":"IF(C66=\"\",\"\",4011)","v":4011},{"$f":"IF(C66=\"\",\"\",IF('Bidragsforskning VR (Prisma)'!$D$9=\"\",\"Ange projeknummer\",'Bidragsforskning VR (Prisma)'!$D$9))","v":"Ange projeknummer"},{"$f":"IF('Bidragsforskning VR (Prisma)'!$D$7<'Bidragsforskning VR (Prisma)'!$P$52,\"\",'Bidragsforskning VR (Prisma)'!$P$52&\"01\")","v":"01"},{"$f":"IF('Bidragsforskning VR (Prisma)'!$D$7<'Bidragsforskning VR (Prisma)'!$P$52,\"\",'Bidragsforskning VR (Prisma)'!$P$52&\"12\")","v":"12"},{"$f":"IFERROR(IF(C66=\"\",\"\",ROUND('Bidragsforskning VR (Prisma)'!P$117,0)),0)","v":0},{"$f":"IF(C66=\"\",\"\",\"Budget år \"&LEFT(C66,4))","v":"Budget år 01"}]
[{"$f":"IF(C67=\"\",\"\",50111)","v":50111},{"$f":"IF(C67=\"\",\"\",IF('Bidragsforskning VR (Prisma)'!$D$9=\"\",\"Ange projeknummer\",'Bidragsforskning VR (Prisma)'!$D$9))","v":"Ange projeknummer"},{"$f":"IF('Bidragsforskning VR (Prisma)'!$D$7<'Bidragsforskning VR (Prisma)'!$P$52,\"\",'Bidragsforskning VR (Prisma)'!$P$52&\"01\")","v":"01"},{"$f":"IF('Bidragsforskning VR (Prisma)'!$D$7<'Bidragsforskning VR (Prisma)'!$P$52,\"\",'Bidragsforskning VR (Prisma)'!$P$52&\"12\")","v":"12"},{"$f":"IFERROR(IF(C67=\"\",\"\",ROUND('Bidragsforskning VR (Prisma)'!P$120,0)),0)","v":0},"Budget år 01"]
[{"$f":"IF(C68=\"\",\"\",5871)","v":5871},{"$f":"IF(C68=\"\",\"\",IF('Bidragsforskning VR (Prisma)'!$D$9=\"\",\"Ange projeknummer\",'Bidragsforskning VR (Prisma)'!$D$9))","v":"Ange projeknummer"},{"$f":"IF('Bidragsforskning VR (Prisma)'!$D$7<'Bidragsforskning VR (Prisma)'!$P$52,\"\",'Bidragsforskning VR (Prisma)'!$P$52&\"01\")","v":"01"},{"$f":"IF('Bidragsforskning VR (Prisma)'!$D$7<'Bidragsforskning VR (Prisma)'!$P$52,\"\",'Bidragsforskning VR (Prisma)'!$P$52&\"12\")","v":"12"},{"$f":"IFERROR(IF(C68=\"\",\"\",ROUND(SUM('Bidragsforskning VR (Prisma)'!P$81:P$90),0)),0)","v":0},"Budget år 01"]
[{"$f":"IF(C69=\"\",\"\",57849)","v":57849},{"$f":"IF(C69=\"\",\"\",IF('Bidragsforskning VR (Prisma)'!$D$9=\"\",\"Ange projeknummer\",'Bidragsforskning VR (Prisma)'!$D$9))","v":"Ange projeknummer"},{"$f":"IF('Bidragsforskning VR (Prisma)'!$D$7<'Bidragsforskning VR (Prisma)'!$P$52,\"\",'Bidragsforskning VR (Prisma)'!$P$52&\"01\")","v":"01"},{"$f":"IF('Bidragsforskning VR (Prisma)'!$D$7<'Bidragsforskning VR (Prisma)'!$P$52,\"\",'Bidragsforskning VR (Prisma)'!$P$52&\"12\")","v":"12"},{"$f":"IFERROR(IF(C69=\"\",\"\",ROUND(SUM('Bidragsforskning VR (Prisma)'!P$92:P$96),0)),0)","v":0},"Budget år 01"]
[{"$f":"IF(C70=\"\",\"\",6911)","v":6911},{"$f":"IF(C70=\"\",\"\",IF('Bidragsforskning VR (Prisma)'!$D$9=\"\",\"Ange projeknummer\",'Bidragsforskning VR (Prisma)'!$D$9))","v":"Ange projeknummer"},{"$f":"IF('Bidragsforskning VR (Prisma)'!$D$7<'Bidragsforskning VR (Prisma)'!$P$52,\"\",'Bidragsforskning VR (Prisma)'!$P$52&\"01\")","v":"01"},{"$f":"IF('Bidragsforskning VR (Prisma)'!$D$7<'Bidragsforskning VR (Prisma)'!$P$52,\"\",'Bidragsforskning VR (Prisma)'!$P$52&\"12\")","v":"12"},{"$f":"IFERROR(IF(C70=\"\",\"\",ROUND('Bidragsforskning VR (Prisma)'!P$119,0)),0)","v":0},"Budget år 01"]
[{"$f":"IF(C71=\"\",\"\",49988)","v":49988},{"$f":"IF(C71=\"\",\"\",IF('Bidragsforskning VR (Prisma)'!$D$9=\"\",\"Ange projeknummer\",'Bidragsforskning VR (Prisma)'!$D$9))","v":"Ange projeknummer"},{"$f":"IF('Bidragsforskning VR (Prisma)'!$D$7<'Bidragsforskning VR (Prisma)'!$P$52,\"\",'Bidragsforskning VR (Prisma)'!$P$52&\"01\")","v":"01"},{"$f":"IF('Bidragsforskning VR (Prisma)'!$D$7<'Bidragsforskning VR (Prisma)'!$P$52,\"\",'Bidragsforskning VR (Prisma)'!$P$52&\"12\")","v":"12"},{"$f":"IFERROR(IF(C71=\"\",\"\",ROUND('Bidragsforskning VR (Prisma)'!P$122,0)),0)","v":0},"Budget år 01"]

{"sheet":"Tabell Prisma","index":5,"n_rows":6,"n_cols":1,"rows_kept":6,"cut":false,"hidden":true,"merged":[]}
["Doktorand"]
["Medverkande administratör"]
["Medverkande forskare"]
["Projektledare"]
["Övrig disputerad personal"]
["Övrig ej disputerad personal"]

{"sheet":"Bidragsforskning","index":6,"n_rows":175,"n_cols":21,"rows_kept":175,"cut":false,"hidden":false,"merged":[[123,2,123,4],[124,2,124,4],[126,2,126,4],[125,2,125,4],[97,2,97,6],[97,7,97,8],[97,9,97,10],[97,11,97,12],[118,2,118,4],[120,2,120,4],[111,2,111,5],[97,13,97,14],[97,15,97,16],[92,20,95,25],[101,15,101,16],[128,15,128,16],[128,7,128,8],[118,20,136,25],[114,20,117,25],[101,20,113,25],[122,11,122,12],[122,13,122,14],[134,15,134,16],[136,15,136,16],[122,7,122,8],[122,9,122,10],[113,13,113,14],[128,13,128,14],[128,9,128,10],[2,20,23,25],[153,2,153,4],[154,2,154,4],[101,9,101,10],[44,20,44,24],[32,3,32,4],[31,3,31,4],[39,7,39,8],[39,9,39,10],[39,11,39,12],[39,13,39,14],[101,7,101,8],[74,7,74,8],[74,9,74,10],[74,11,74,12],[74,13,74,14],[78,7,78,8],[153,7,153,8],[153,9,153,10],[153,11,153,12],[153,13,153,14],[140,2,140,5],[141,2,141,5],[95,2,95,5],[139,2,139,5],[131,2,131,5],[132,2,132,5],[130,2,130,5],[129,2,129,5],[166,2,166,4],[166,7,166,8],[166,9,166,10],[166,11,166,12],[144,2,144,4],[144,11,144,12],[158,2,158,4],[164,2,164,4],[156,2,156,4],[161,2,161,4],[162,2,162,4],[163,2,163,4],[144,9,144,10],[136,2,136,4],[136,7,136,8],[166,13,166,14],[171,20,174,25],[173,6,173,7],[147,15,147,16],[161,7,161,8],[161,9,161,10],[161,11,161,12],[161,13,161,14],[161,15,161,16],[164,7,164,8],[164,9,164,10],[164,11,164,12],[163,7,163,8],[163,9,163,10],[147,11,147,12],[147,13,147,14],[153,15,153,16],[147,7,147,8],[154,13,154,14],[158,5,158,6],[158,9,158,10],[158,11,158,12],[137,20,145,25],[156,15,156,16],[158,15,158,16],[162,15,162,16],[163,15,163,16],[162,7,162,8],[162,9,162,10],[162,11,162,12],[162,13,162,14],[154,7,154,8],[154,9,154,10],[154,11,154,12],[163,13,163,14],[158,13,158,14],[155,13,155,14],[156,13,156,14],[155,11,155,12],[154,15,154,16],[147,9,147,10],[144,15,144,16],[144,13,144,14],[144,7,144,8],[163,11,163,12],[158,7,158,8],[45,20,66,25],[48,3,48,4],[52,3,52,4],[53,3,53,4],[54,3,54,4],[58,3,58,4],[59,3,59,4],[60,3,60,4],[51,7,51,8],[51,9,51,10],[51,11,51,12],[51,13,51,14],[57,7,57,8],[57,9,57,10],[57,11,57,12],[63,11,63,12],[63,13,63,14],[51,15,51,16],[57,15,57,16],[63,15,63,16],[45,3,45,4],[64,3,64,4],[65,3,65,4],[57,13,57,14],[85,7,85,8],[85,9,85,10],[85,11,85,12],[101,11,101,12],[101,13,101,14],[119,2,119,4],[83,7,83,8],[83,9,83,10],[117,11,117,12],[117,13,117,14],[113,7,113,8],[113,9,113,10],[113,11,113,12],[102,2,102,5],[103,2,103,5],[104,2,104,5],[105,2,105,5],[106,2,106,5],[107,2,107,5],[108,2,108,5],[83,2,83,4],[113,2,113,6],[117,7,117,8],[117,9,117,10],[81,3,81,4],[68,7,68,8],[68,9,68,10],[68,11,68,12],[68,13,68,14],[71,2,71,5],[44,3,44,4],[83,15,83,16],[63,7,63,8],[63,9,63,10],[78,9,78,10],[83,11,83,12],[83,13,83,14],[5,1,20,17],[39,15,39,16],[43,15,43,16],[66,3,66,4],[70,2,70,5],[79,3,79,4],[80,3,80,4],[78,11,78,12],[68,2,68,4],[85,15,85,16],[91,7,91,8],[91,9,91,10],[91,11,91,12],[91,13,91,14],[156,9,156,10],[156,11,156,12],[155,2,155,4],[155,15,155,16],[155,7,155,8],[136,9,136,10],[136,11,136,12],[136,13,136,14],[128,11,128,12],[134,2,134,6],[134,7,134,8],[134,9,134,10],[134,11,134,12],[134,13,134,14],[91,15,91,16],[92,2,92,5],[93,2,93,5],[94,2,94,5],[85,13,85,14],[24,20,38,25],[161,20,168,25],[150,20,159,25],[70,20,73,25],[78,20,81,25],[74,2,74,6],[68,15,68,16],[74,15,74,16],[78,15,78,16],[33,3,33,4],[43,7,43,8],[43,9,43,10],[43,11,43,12],[43,13,43,14],[78,13,78,14],[113,15,113,16],[117,15,117,16],[122,15,122,16],[85,2,85,4],[155,9,155,10],[164,13,164,14],[164,15,164,16],[166,15,166,16],[156,7,156,8]]}
[null,"BIDRAGSFORSKNING - FULL KOSTNADSTÄCKNINGSKALKYL"]
[]
[null,null,null,null,null,null,null,null,null,null,null,null,null,null,null,null,null,null,null,null,"Instruktioner\n\nGenerellt\nMed knappen under rubriken väljs typ av mall, uppdrag / bidragskalkylmall. Det går alltid att hoppa mellan olika mallar utan att förlora inmatade uppgifter.\n\nDe vita cellerna i mallen fylls i med värden och de färgade cellerna är beräkningar som filen gör automatiskt. Namn / beskrivningar som är ifyllda exempel bör raderas.\n\nGrupperingarna / plusknapparna (1, 2 och 3) ute till vänster i filen gör det möjligt att komprimera och expandera kostnads- / intäktsdetaljerna. Grupperingen / plusknappen längst upp (ovanför R kolumnen) ger utökade antal år.\n\nVid behov kan ytterligare rader och även kolumner (för år) infogas, men då med viss försiktighet då formler inte följer med automatiskt. Vid behov av ytterligare rader är rekommenderat att kopiera en hel rad  i mitten av de kostnader / intäkter där behov av ytterligare poster uppstår och sedan infoga hela den kopierade raden på samma rad. Vid behov av ytterligare år rekommenderas kontakt med EA eller att två seprata mallar nyttjas för uträkning men med olika projekt start år.\n\nOmf.%  innebär omfattning av heltid\nNyttj % innebär nyttjandegrad av resursen i procent\nFörbr % innebär förbrukningsgrad av resursen i procent\n"]
[]
[]
[null,"Inledning för bidrag\n\nMed bidrag menas medel som tas emot utan krav på motprestation i form av till exempel varor, tjänster eller särskilda förmåner. Finansiären kan dock villkora vad bidraget får användas till och dessutom ställa krav på återrapportering av hur medlen nyttjats.\n\nDenna mall är ämnad för att stötta beräkning av ett forskningsprojekts kostnader samt finansiering och därmed även det eventuella samfinansieringsbehovet som kan uppstå. Med samfinansieringsbehov i detta sammanhang menas den del av kostnader som uppstår i projektet som inte har beviljats täckning från huvudfinansiärerna.\n\nTill skillnad från uppdragsforskningskalkylmallen kan denna mall med fördel även användas som underlag att bifoga en ansökan där bidragsgivaren så kräver. Detta kan ske då de inte själva tillhandahåller någon specifik mall. Mallen i sig kan skrivas ut i komprimerad form genom grupperingsfunktionen till vänster i bladet.\n\nMallen ska alltid skrivas under av prefekt, eller av den till vilken prefekten delegerat beslutsrätten, när det ansökta bidraget överstiger 100 000 kr. I dessa fall ska ett exemplar av ansökan och kalkylen diarieföras och sparas. Vid beviljade ansökningar ska kalkylen bifogas i Avtalsreskontran i KIs affärssystem."]
[]
[]
[]
[]
[]
[]
[]
[]
[]
[]
[]
[]
[]
[]
[]
[]
[]
[]
[null,null,null,null,null,null,null,null,null,null,null,null,null,null,null,null,null,null,null,null,"Grundläggande uppgifter\nHär väljs institutionskod i rullistan som påverkar de indirekta kostnaderna (INDI) både i denna mall men även värden i specifikations- och uppföljningsflikar.\n\nInnevarande år kommer upp automatiskt, men val av projektets start år påverkar Index av personal-, drift-, och lokalkostnader.\n\nFör uppdrag redogörs även om projektet är internt, statligt, externt eller övrigt uppdrag och där moms av annan anldening ska exkluderas.\n\nResten av fälten är fritextfält, men observera att framförallt projektnumret och även de andra fält hämtas upp av de övriga bladen."]
[null,null,"GRUNDLÄGGANDE UPPGIFTER"]
[]
[null,null,"Institutionskod"]
[null,null,"Innevarande år",{"$f":"Tabeller!$A$1","v":2025}]
[null,null,"Projektets start år/månad"]
[null,null,"Projektets slut år/månad"]
[null,null,"Projektledare/-ansvarig"]
[null,null,"Projektnummer - UBW"]
[null,null,"Beskrivnig av projektet"]
[]
[]
[]
[null,null,{"$f":"\"PROJEKTKOSTNADER\"&\" - \"&LEFT($B$1,(LEN($B$1)-41))","v":"PROJEKTKOSTNADER - BIDRAG"}]
[]
[null,null,"A. Personalkostnader",null,null,null,null,{"$f":"IF($D$30=\"\",\"\",IF($D$29>$D$30,\"Fel i grundläggande uppgifter\",$D$30))","v":""},null,{"$f":"IFERROR(H40+1,\"\")","v":""},null,{"$f":"IFERROR(J40+1,\"\")","v":""},null,{"$f":"IFERROR(L40+1,\"\")","v":""},null,{"$f":"IFERROR(N40+1,\"\")","v":""}]
[null,null,"A.1 Medverkande personal med LÖN från KI"]
[]
[null,null,"A.1.1 - Projektledare"]
[null,null,null,null,null,null,null,{"$f":"IF($D$30=\"\",\"\",IF($D$29>$D$30,\"Fel i grunduppgifter\",$D$30))","v":""},null,{"$f":"IFERROR(H44+1,\"\")","v":""},null,{"$f":"IFERROR(J44+1,\"\")","v":""},null,{"$f":"IFERROR(L44+1,\"\")","v":""},null,{"$f":"IFERROR(N44+1,\"\")","v":""},null,null,null,null,"Personalkostnader"]
[null,null,"Namn/Roll","Arbetsmoment/Beskrivning",null,"Antal timmar","Månadslön (kr)","Omf. %",{"$f":"IF($D$29=$D$30,\"inkl. index 0%\",\"inkl. index 4%\")","v":"inkl. index 4%"},"Omf. %","inkl. index 3%","Omf. %","inkl. index 3%","Omf. %","inkl. index 3%","Omf. %","inkl. index 3%"]
[null,null,"Professor1",null,null,{"$f":"(H46+J46+L46+N46+P46)*1680","v":0},null,null,{"$f":"IFERROR(IF(OR($D$29=\"\",$D$30=\"\"),\"År saknas\",(($G46*12)*H46*((1+(MID(I$45,12,2))/100)^(H$44-$D$29)))),0)","v":"År saknas"},null,{"$f":"IFERROR(IF(OR($D$29=\"\",$D$30=\"\"),\"År saknas\",(($G46*12)*J46*((1+(MID(K$45,12,2))/100)^(J$44-$D$29)))),0)","v":"År saknas"},null,{"$f":"IFERROR(IF(OR($D$29=\"\",$D$30=\"\"),\"År saknas\",(($G46*12)*L46*((1+(MID(M$45,12,2))/100)^(L$44-$D$29)))),0)","v":"År saknas"},null,{"$f":"IFERROR(IF(OR($D$29=\"\",$D$30=\"\"),\"År saknas\",(($G46*12)*N46*((1+(MID(O$45,12,2))/100)^(N$44-$D$29)))),0)","v":"År saknas"},null,{"$f":"IFERROR(IF(OR($D$29=\"\",$D$30=\"\"),\"År saknas\",(($G46*12)*P46*((1+(MID(Q$45,12,2))/100)^(P$44-$D$29)))),0)","v":"År saknas"},null,null,null,"Beräkningen baserar sig på total månadsersättning och omfattning av heltid i projektet.\n\nFör bidragsforksning nyttjas bruttolön och standardtiden anges automatiskt, vilket motsvarar 1680 timmar per år på KI.\n\nFör externa uppdrag ska månadsersättning baseras på debiterbar tid. Bruttolönen behöver beräknas om till debiterbar månadsersättning. Detta är högre än bruttolönen då avräkning för indirekt tid eller produktionsbortfall såsom egen- administration, utbildning och utvecklingsarbete görs. Mallen utgår ifrån en standard produktionsbortfall om 480 timmar, men denna kan enkelt justeras genom att ange nya siffror i beräkningsunderlaget längst ner i bladet. (se även länk ovan eller i rubriken för månadsersättning)\n\nIndex för personalkostnader är satt till 2% ökning per år."]
[null,null,null,null,null,{"$f":"(H47+J47+L47+N47+P47)*1680","v":0},null,null,{"$f":"IFERROR(IF(OR($D$29=\"\",$D$30=\"\"),\"År saknas\",(($G47*12)*H47*((1+(MID(I$45,12,2))/100)^(H$44-$D$29)))),0)","v":"År saknas"},null,{"$f":"IFERROR(IF(OR($D$29=\"\",$D$30=\"\"),\"År saknas\",(($G47*12)*J47*((1+(MID(K$45,12,2))/100)^(J$44-$D$29)))),0)","v":"År saknas"},null,{"$f":"IFERROR(IF(OR($D$29=\"\",$D$30=\"\"),\"År saknas\",(($G47*12)*L47*((1+(MID(M$45,12,2))/100)^(L$44-$D$29)))),0)","v":"År saknas"},null,{"$f":"IFERROR(IF(OR($D$29=\"\",$D$30=\"\"),\"År saknas\",(($G47*12)*N47*((1+(MID(O$45,12,2))/100)^(N$44-$D$29)))),0)","v":"År saknas"},null,{"$f":"IFERROR(IF(OR($D$29=\"\",$D$30=\"\"),\"År saknas\",(($G47*12)*P47*((1+(MID(Q$45,12,2))/100)^(P$44-$D$29)))),0)","v":"År saknas"}]
[null,null,null,null,null,{"$f":"(H48+J48+L48+N48+P48)*1680","v":0},null,null,{"$f":"IFERROR(IF(OR($D$29=\"\",$D$30=\"\"),\"År saknas\",(($G48*12)*H48*((1+(MID(I$45,12,2))/100)^(H$44-$D$29)))),0)","v":"År saknas"},null,{"$f":"IFERROR(IF(OR($D$29=\"\",$D$30=\"\"),\"År saknas\",(($G48*12)*J48*((1+(MID(K$45,12,2))/100)^(J$44-$D$29)))),0)","v":"År saknas"},null,{"$f":"IFERROR(IF(OR($D$29=\"\",$D$30=\"\"),\"År saknas\",(($G48*12)*L48*((1+(MID(M$45,12,2))/100)^(L$44-$D$29)))),0)","v":"År saknas"},null,{"$f":"IFERROR(IF(OR($D$29=\"\",$D$30=\"\"),\"År saknas\",(($G48*12)*N48*((1+(MID(O$45,12,2))/100)^(N$44-$D$29)))),0)","v":"År saknas"},null,{"$f":"IFERROR(IF(OR($D$29=\"\",$D$30=\"\"),\"År saknas\",(($G48*12)*P48*((1+(MID(Q$45,12,2))/100)^(P$44-$D$29)))),0)","v":"År saknas"}]
[null,null,null,null,null,{"$f":"(H49+J49+L49+N49+P49)*1680","v":0},null,null,{"$f":"IFERROR(IF(OR($D$29=\"\",$D$30=\"\"),\"År saknas\",(($G49*12)*H49*((1+(MID(I$45,12,2))/100)^(H$44-$D$29)))),0)","v":"År saknas"},null,{"$f":"IFERROR(IF(OR($D$29=\"\",$D$30=\"\"),\"År saknas\",(($G49*12)*J49*((1+(MID(K$45,12,2))/100)^(J$44-$D$29)))),0)","v":"År saknas"},null,{"$f":"IFERROR(IF(OR($D$29=\"\",$D$30=\"\"),\"År saknas\",(($G49*12)*L49*((1+(MID(M$45,12,2))/100)^(L$44-$D$29)))),0)","v":"År saknas"},null,{"$f":"IFERROR(IF(OR($D$29=\"\",$D$30=\"\"),\"År saknas\",(($G49*12)*N49*((1+(MID(O$45,12,2))/100)^(N$44-$D$29)))),0)","v":"År saknas"},null,{"$f":"IFERROR(IF(OR($D$29=\"\",$D$30=\"\"),\"År saknas\",(($G49*12)*P49*((1+(MID(Q$45,12,2))/100)^(P$44-$D$29)))),0)","v":"År saknas"}]
[]
[null,null,"A.1.2 - Doktorander"]
[null,null,null,null,null,null,null,{"$f":"IF($D$30=\"\",\"\",IF($D$29>$D$30,\"Fel i grunduppgifter\",$D$30))","v":""},null,{"$f":"IFERROR(H52+1,\"\")","v":""},null,{"$f":"IFERROR(J52+1,\"\")","v":""},null,{"$f":"IFERROR(L52+1,\"\")","v":""},null,{"$f":"IFERROR(N52+1,\"\")","v":""}]
[null,null,"Namn/Roll","Arbetsmoment/Beskrivning",null,"Antal timmar","Månadslön (kr)","Omf. %",{"$f":"IF($D$29=$D$30,\"inkl. index 0%\",\"inkl. index 4%\")","v":"inkl. index 4%"},"Omf. %","inkl. index 3%","Omf. %","inkl. index 3%","Omf. %","inkl. index 3%","Omf. %","inkl. index 3%"]
[null,null,"Doktorand1",null,null,{"$f":"(H54+J54+L54+N54+P54)*1680","v":0},null,null,{"$f":"IFERROR(IF(OR($D$29=\"\",$D$30=\"\"),\"År saknas\",(($G54*12)*H54*((1+(MID(I$53,12,2))/100)^(H$52-$D$29)))),0)","v":"År saknas"},null,{"$f":"IFERROR(IF(OR($D$29=\"\",$D$30=\"\"),\"År saknas\",(($G54*12)*J54*((1+(MID(K$53,12,2))/100)^(J$52-$D$29)))),0)","v":"År saknas"},null,{"$f":"IFERROR(IF(OR($D$29=\"\",$D$30=\"\"),\"År saknas\",(($G54*12)*L54*((1+(MID(M$53,12,2))/100)^(L$52-$D$29)))),0)","v":"År saknas"},null,{"$f":"IFERROR(IF(OR($D$29=\"\",$D$30=\"\"),\"År saknas\",(($G54*12)*N54*((1+(MID(O$53,12,2))/100)^(N$52-$D$29)))),0)","v":"År saknas"},null,{"$f":"IFERROR(IF(OR($D$29=\"\",$D$30=\"\"),\"År saknas\",(($G54*12)*P54*((1+(MID(Q$53,12,2))/100)^(P$52-$D$29)))),0)","v":"År saknas"}]
[null,null,null,null,null,{"$f":"(H55+J55+L55+N55+P55)*1680","v":0},null,null,{"$f":"IFERROR(IF(OR($D$29=\"\",$D$30=\"\"),\"År saknas\",(($G55*12)*H55*((1+(MID(I$53,12,2))/100)^(H$52-$D$29)))),0)","v":"År saknas"},null,{"$f":"IFERROR(IF(OR($D$29=\"\",$D$30=\"\"),\"År saknas\",(($G55*12)*J55*((1+(MID(K$53,12,2))/100)^(J$52-$D$29)))),0)","v":"År saknas"},null,{"$f":"IFERROR(IF(OR($D$29=\"\",$D$30=\"\"),\"År saknas\",(($G55*12)*L55*((1+(MID(M$53,12,2))/100)^(L$52-$D$29)))),0)","v":"År saknas"},null,{"$f":"IFERROR(IF(OR($D$29=\"\",$D$30=\"\"),\"År saknas\",(($G55*12)*N55*((1+(MID(O$53,12,2))/100)^(N$52-$D$29)))),0)","v":"År saknas"},null,{"$f":"IFERROR(IF(OR($D$29=\"\",$D$30=\"\"),\"År saknas\",(($G55*12)*P55*((1+(MID(Q$53,12,2))/100)^(P$52-$D$29)))),0)","v":"År saknas"}]
[]
[null,null,"A.1.3 - Övrig forskande personal"]
[null,null,null,null,null,null,null,{"$f":"IF($D$30=\"\",\"\",IF($D$29>$D$30,\"Fel i grunduppgifter\",$D$30))","v":""},null,{"$f":"IFERROR(H58+1,\"\")","v":""},null,{"$f":"IFERROR(J58+1,\"\")","v":""},null,{"$f":"IFERROR(L58+1,\"\")","v":""},null,{"$f":"IFERROR(N58+1,\"\")","v":""}]
[null,null,"Namn/Roll","Arbetsmoment/Beskrivning",null,"Antal timmar","Månadslön (kr)","Omf. %",{"$f":"IF($D$29=$D$30,\"inkl. index 0%\",\"inkl. index 4%\")","v":"inkl. index 4%"},"Omf. %","inkl. index 3%","Omf. %","inkl. index 3%","Omf. %","inkl. index 3%","Omf. %","inkl. index 3%"]
[null,null,"Forskningsassistent1",null,null,{"$f":"(H60+J60+L60+N60+P60)*1680","v":0},null,null,{"$f":"IFERROR(IF(OR($D$29=\"\",$D$30=\"\"),\"År saknas\",(($G60*12)*H60*((1+(MID(I$59,12,2))/100)^(H$58-$D$29)))),0)","v":"År saknas"},null,{"$f":"IFERROR(IF(OR($D$29=\"\",$D$30=\"\"),\"År saknas\",(($G60*12)*J60*((1+(MID(K$59,12,2))/100)^(J$58-$D$29)))),0)","v":"År saknas"},null,{"$f":"IFERROR(IF(OR($D$29=\"\",$D$30=\"\"),\"År saknas\",(($G60*12)*L60*((1+(MID(M$59,12,2))/100)^(L$58-$D$29)))),0)","v":"År saknas"},null,{"$f":"IFERROR(IF(OR($D$29=\"\",$D$30=\"\"),\"År saknas\",(($G60*12)*N60*((1+(MID(O$59,12,2))/100)^(N$58-$D$29)))),0)","v":"År saknas"},null,{"$f":"IFERROR(IF(OR($D$29=\"\",$D$30=\"\"),\"År saknas\",(($G60*12)*P60*((1+(MID(Q$59,12,2))/100)^(P$58-$D$29)))),0)","v":"År saknas"}]
[null,null,null,null,null,{"$f":"(H61+J61+L61+N61+P61)*1680","v":0},null,null,{"$f":"IFERROR(IF(OR($D$29=\"\",$D$30=\"\"),\"År saknas\",(($G61*12)*H61*((1+(MID(I$59,12,2))/100)^(H$58-$D$29)))),0)","v":"År saknas"},null,{"$f":"IFERROR(IF(OR($D$29=\"\",$D$30=\"\"),\"År saknas\",(($G61*12)*J61*((1+(MID(K$59,12,2))/100)^(J$58-$D$29)))),0)","v":"År saknas"},null,{"$f":"IFERROR(IF(OR($D$29=\"\",$D$30=\"\"),\"År saknas\",(($G61*12)*L61*((1+(MID(M$59,12,2))/100)^(L$58-$D$29)))),0)","v":"År saknas"},null,{"$f":"IFERROR(IF(OR($D$29=\"\",$D$30=\"\"),\"År saknas\",(($G61*12)*N61*((1+(MID(O$59,12,2))/100)^(N$58-$D$29)))),0)","v":"År saknas"},null,{"$f":"IFERROR(IF(OR($D$29=\"\",$D$30=\"\"),\"År saknas\",(($G61*12)*P61*((1+(MID(Q$59,12,2))/100)^(P$58-$D$29)))),0)","v":"År saknas"}]
[]
[null,null,"A.1.4 - TA-personal som ej ingår i det gemensamma stödet"]
[null,null,null,null,null,null,null,{"$f":"IF($D$30=\"\",\"\",IF($D$29>$D$30,\"Fel i grunduppgifter\",$D$30))","v":""},null,{"$f":"IFERROR(H64+1,\"\")","v":""},null,{"$f":"IFERROR(J64+1,\"\")","v":""},null,{"$f":"IFERROR(L64+1,\"\")","v":""},null,{"$f":"IFERROR(N64+1,\"\")","v":""}]
[null,null,"Namn/Roll","Arbetsmoment/Beskrivning",null,"Antal timmar","Månadslön (kr)","Omf. %",{"$f":"IF($D$29=$D$30,\"inkl. index 0%\",\"inkl. index 4%\")","v":"inkl. index 4%"},"Omf. %","inkl. index 3%","Omf. %","inkl. index 3%","Omf. %","inkl. index 3%","Omf. %","inkl. index 3%"]
[null,null,"Administratör1",null,null,{"$f":"(H66+J66+L66+N66+P66)*1680","v":0},null,null,{"$f":"IFERROR(IF(OR($D$29=\"\",$D$30=\"\"),\"År saknas\",(($G66*12)*H66*((1+(MID(I$65,12,2))/100)^(H$64-$D$29)))),0)","v":"År saknas"},null,{"$f":"IFERROR(IF(OR($D$29=\"\",$D$30=\"\"),\"År saknas\",(($G66*12)*J66*((1+(MID(K$65,12,2))/100)^(J$64-$D$29)))),0)","v":"År saknas"},null,{"$f":"IFERROR(IF(OR($D$29=\"\",$D$30=\"\"),\"År saknas\",(($G66*12)*L66*((1+(MID(M$65,12,2))/100)^(L$64-$D$29)))),0)","v":"År saknas"},null,{"$f":"IFERROR(IF(OR($D$29=\"\",$D$30=\"\"),\"År saknas\",(($G66*12)*N66*((1+(MID(O$65,12,2))/100)^(N$64-$D$29)))),0)","v":"År saknas"},null,{"$f":"IFERROR(IF(OR($D$29=\"\",$D$30=\"\"),\"År saknas\",(($G66*12)*P66*((1+(MID(Q$65,12,2))/100)^(P$64-$D$29)))),0)","v":"År saknas"}]
[null,null,null,null,null,{"$f":"(H67+J67+L67+N67+P67)*1680","v":0},null,null,{"$f":"IFERROR(IF(OR($D$29=\"\",$D$30=\"\"),\"År saknas\",(($G67*12)*H67*((1+(MID(I$65,12,2))/100)^(H$64-$D$29)))),0)","v":"År saknas"},null,{"$f":"IFERROR(IF(OR($D$29=\"\",$D$30=\"\"),\"År saknas\",(($G67*12)*J67*((1+(MID(K$65,12,2))/100)^(J$64-$D$29)))),0)","v":"År saknas"},null,{"$f":"IFERROR(IF(OR($D$29=\"\",$D$30=\"\"),\"År saknas\",(($G67*12)*L67*((1+(MID(M$65,12,2))/100)^(L$64-$D$29)))),0)","v":"År saknas"},null,{"$f":"IFERROR(IF(OR($D$29=\"\",$D$30=\"\"),\"År saknas\",(($G67*12)*N67*((1+(MID(O$65,12,2))/100)^(N$64-$D$29)))),0)","v":"År saknas"},null,{"$f":"IFERROR(IF(OR($D$29=\"\",$D$30=\"\"),\"År saknas\",(($G67*12)*P67*((1+(MID(Q$65,12,2))/100)^(P$64-$D$29)))),0)","v":"År saknas"}]
[]
[null,null,"Summa Personalkostnader exkl. lönekostnadspålägg (LKP)",null,null,{"$f":"SUM(F$46:F67)","v":0},null,{"$f":"SUM(I$46:I67)","v":0},null,{"$f":"SUM(K$46:K67)","v":0},null,{"$f":"SUM(M$46:M67)","v":0},null,{"$f":"SUM(O$46:O67)","v":0},null,{"$f":"SUM(Q$46:Q67)","v":0}]
[]
[null,null,"Sociala avgifter  (LKP) - 2023",null,null,null,0.54010000000000002,null,null,null,null,null,null,null,null,null,null,null,null,null,"LKP\nLKP (Lönekostnadspålägg) är en kostnad som de flesta arbetsgivare har för den anställda utöver den individuella bruttolönen som den anställda har.\nDetta är en standardsats som revideras centralt årligen."]
[null,null,"Semestertillägg",null,null,null,1.8499999999999999E-2]
[null,null,null,null,null,"LKP Total",{"$f":"SUM(G71:G72)","v":0.55859999999999999}]
[]
[null,null,"Summa personalkostnad där lönekostnadspålägg (LKP) ingår",null,null,null,null,{"$f":"SUM(H69)*(1+$G73)","v":0},null,{"$f":"SUM(J69)*(1+$G73)","v":0},null,{"$f":"SUM(L69)*(1+$G73)","v":0},null,{"$f":"SUM(N69)*(1+$G73)","v":0},null,{"$f":"SUM(P69)*(1+$G73)","v":0}]
[]
[null,null,"A.2 Övriga medverkande som har annan ersättning än lön (dessa exkluderas från LKP)"]
[null,null,"A.2.1 - Övriga medverkande "]
[null,null,null,null,null,null,null,{"$f":"IF($D$30=\"\",\"\",IF($D$29>$D$30,\"Fel i grunduppgifter\",$D$30))","v":""},null,{"$f":"IFERROR(H79+1,\"\")","v":""},null,{"$f":"IFERROR(J79+1,\"\")","v":""},null,{"$f":"IFERROR(L79+1,\"\")","v":""},null,{"$f":"IFERROR(N79+1,\"\")","v":""},null,null,null,null,"Övriga medverkande (exkl. LKP)\nDetta är främst för stipendiater, men kan även användas för medverkande där LKP inte ska ingå av andra eventuella skäl."]
[null,null,"Namn/Roll","Arbetsmoment/Beskrivning",null,"Antal timmar","Månadsers. (kr)","Omf. %",{"$f":"IF($D$29=$D$30,\"inkl. index 0%\",\"inkl. index 0%\")","v":"inkl. index 0%"},"Omf. %","inkl. index 0%","Omf. %","inkl. index 0%","Omf. %","inkl. index 0%","Omf. %","inkl. index 0%"]
[null,null,"Stipendiat 1",null,null,{"$f":"(H81+J81+L81+N81+P81)*1680","v":0},null,null,{"$f":"IFERROR(IF(OR($D$29=\"\",$D$30=\"\"),\"År saknas\",(($G81*12)*H81*((1+(MID(I$80,12,2))/100)^(H$79-$D$29)))),0)","v":"År saknas"},null,{"$f":"IFERROR(IF(OR($D$29=\"\",$D$30=\"\"),\"År saknas\",(($G81*12)*J81*((1+(MID(K$80,12,2))/100)^(J$79-$D$29)))),0)","v":"År saknas"},null,{"$f":"IFERROR(IF(OR($D$29=\"\",$D$30=\"\"),\"År saknas\",(($G81*12)*L81*((1+(MID(M$80,12,2))/100)^(L$79-$D$29)))),0)","v":"År saknas"},null,{"$f":"IFERROR(IF(OR($D$29=\"\",$D$30=\"\"),\"År saknas\",(($G81*12)*N81*((1+(MID(O$80,12,2))/100)^(N$79-$D$29)))),0)","v":"År saknas"},null,{"$f":"IFERROR(IF(OR($D$29=\"\",$D$30=\"\"),\"År saknas\",(($G81*12)*P81*((1+(MID(Q$80,12,2))/100)^(P$79-$D$29)))),0)","v":"År saknas"}]
[null,null,null,null,null,{"$f":"(H82+J82+L82+N82+P82)*1680","v":0},null,null,{"$f":"IFERROR(IF(OR($D$29=\"\",$D$30=\"\"),\"År saknas\",(($G82*12)*H82*((1+(MID(I$80,12,2))/100)^(H$79-$D$29)))),0)","v":"År saknas"},null,{"$f":"IFERROR(IF(OR($D$29=\"\",$D$30=\"\"),\"År saknas\",(($G82*12)*J82*((1+(MID(K$80,12,2))/100)^(J$79-$D$29)))),0)","v":"År saknas"},null,{"$f":"IFERROR(IF(OR($D$29=\"\",$D$30=\"\"),\"År saknas\",(($G82*12)*L82*((1+(MID(M$80,12,2))/100)^(L$79-$D$29)))),0)","v":"År saknas"},null,{"$f":"IFERROR(IF(OR($D$29=\"\",$D$30=\"\"),\"År saknas\",(($G82*12)*N82*((1+(MID(O$80,12,2))/100)^(N$79-$D$29)))),0)","v":"År saknas"},null,{"$f":"IFERROR(IF(OR($D$29=\"\",$D$30=\"\"),\"År saknas\",(($G82*12)*P82*((1+(MID(Q$80,12,2))/100)^(P$79-$D$29)))),0)","v":"År saknas"}]
[]
[null,null,"Summa kostnader för övriga medverkande",null,null,null,null,{"$f":"SUM(I$81:I82)","v":0},null,{"$f":"SUM(K$81:K82)","v":0},null,{"$f":"SUM(M$81:M82)","v":0},null,{"$f":"SUM(O$81:O82)","v":0},null,{"$f":"SUM(Q$81:Q82)","v":0}]
[]
[null,null,"Summa samtliga personalkostnader",null,null,null,null,{"$f":"H84+H75","v":0},null,{"$f":"J84+J75","v":0},null,{"$f":"L84+L75","v":0},null,{"$f":"N84+N75","v":0},null,{"$f":"P84+P75","v":0}]
[]
[null,null,"B. Driftkostnader"]
[]
[null,null,"B.1 Resekostnader"]
[]
[null,null,null,null,null,null,null,{"$f":"IF($D$30=\"\",\"\",IF($D$29>$D$30,\"Fel i grunduppgifter\",$D$30))","v":""},null,{"$f":"IFERROR(H92+1,\"\")","v":""},null,{"$f":"IFERROR(J92+1,\"\")","v":""},null,{"$f":"IFERROR(L92+1,\"\")","v":""},null,{"$f":"IFERROR(N92+1,\"\")","v":""},null,null,null,null,"Resekostnader"]
[null,null,"Resekostnader - beskrivning",null,null,null,"Kostnad att fördela ->","Förbr. %",{"$f":"IF($D$29=$D$30,\"inkl. index 0%\",\"inkl. index 3%\")","v":"inkl. index 3%"},"Förbr. %","inkl. index 3%","Förbr. %","inkl. index 3%","Förbr. %","inkl. index 3%","Förbr. %","inkl. index 3%",null,null,null,"Hit förs alla typer av resekostnader som är förknippade med projektet (inkl. brutto av eventuella skattepliktiga traktamenten)."]
[null,null,"Resa 1",null,null,null,null,null,{"$f":"IF(OR($D$29=\"\",$D$30=\"\"),\"År saknas\",(($G94)*H94)*((1+(MID(I$93,12,2))/100)^(H$92-$D$29)))","v":"År saknas"},null,{"$f":"IF(OR($D$29=\"\",$D$30=\"\"),\"År saknas\",(($G94)*J94)*((1+(MID(K$93,12,2))/100)^(J$102-$D$29)))","v":"År saknas"},null,{"$f":"IF(OR($D$29=\"\",$D$30=\"\"),\"År saknas\",(($G94)*L94)*((1+(MID(M$93,12,2))/100)^(L$92-$D$29)))","v":"År saknas"},null,{"$f":"IF(OR($D$29=\"\",$D$30=\"\"),\"År saknas\",(($G94)*N94)*((1+(MID(O$93,12,2))/100)^(N$92-$D$29)))","v":"År saknas"},null,{"$f":"IF(OR($D$29=\"\",$D$30=\"\"),\"År saknas\",(($G94)*P94)*((1+(MID(Q$93,12,2))/100)^(P$92-$D$29)))","v":"År saknas"}]
[null,null,null,null,null,null,null,null,{"$f":"IF(OR($D$29=\"\",$D$30=\"\"),\"År saknas\",(($G95)*H95)*((1+(MID(I$93,12,2))/100)^(H$102-$D$29)))","v":"År saknas"},null,{"$f":"IF(OR($D$29=\"\",$D$30=\"\"),\"År saknas\",(($G95)*J95)*((1+(MID(K$93,12,2))/100)^(J$92-$D$29)))","v":"År saknas"},null,{"$f":"IF(OR($D$29=\"\",$D$30=\"\"),\"År saknas\",(($G95)*L95)*((1+(MID(M$93,12,2))/100)^(L$92-$D$29)))","v":"År saknas"},null,{"$f":"IF(OR($D$29=\"\",$D$30=\"\"),\"År saknas\",(($G95)*N95)*((1+(MID(O$93,12,2))/100)^(N$92-$D$29)))","v":"År saknas"},null,{"$f":"IF(OR($D$29=\"\",$D$30=\"\"),\"År saknas\",(($G95)*P95)*((1+(MID(Q$93,12,2))/100)^(P$92-$D$29)))","v":"År saknas"}]
[null,null,null,null,null,null,null,null,{"$f":"IF(OR($D$29=\"\",$D$30=\"\"),\"År saknas\",(($G96)*H96)*((1+(MID(I$93,12,2))/100)^(H$102-$D$29)))","v":"År saknas"},null,{"$f":"IF(OR($D$29=\"\",$D$30=\"\"),\"År saknas\",(($G96)*J96)*((1+(MID(K$93,12,2))/100)^(J$92-$D$29)))","v":"År saknas"},null,{"$f":"IF(OR($D$29=\"\",$D$30=\"\"),\"År saknas\",(($G96)*L96)*((1+(MID(M$93,12,2))/100)^(L$92-$D$29)))","v":"År saknas"},null,{"$f":"IF(OR($D$29=\"\",$D$30=\"\"),\"År saknas\",(($G96)*N96)*((1+(MID(O$93,12,2))/100)^(N$92-$D$29)))","v":"År saknas"},null,{"$f":"IF(OR($D$29=\"\",$D$30=\"\"),\"År saknas\",(($G96)*P96)*((1+(MID(Q$93,12,2))/100)^(P$92-$D$29)))","v":"År saknas"}]
[]
[null,null,"Summa resekostnader",null,null,null,null,{"$f":"SUM(I$94:I96)","v":0},null,{"$f":"SUM(K$94:K96)","v":0},null,{"$f":"SUM(M$94:M96)","v":0},null,{"$f":"SUM(O$94:O96)","v":0},null,{"$f":"SUM(Q$94:Q96)","v":0}]
[]
[null,null,"B.2 Direkta driftkostnader (Lokal- och KI-interna kostnader kommer under övriga drifkostnader)"]
[]
[null,null,null,null,null,null,null,{"$f":"IF($D$30=\"\",\"\",IF($D$29>$D$30,\"Fel i grunduppgifter\",$D$30))","v":""},null,{"$f":"IFERROR(H102+1,\"\")","v":""},null,{"$f":"IFERROR(J102+1,\"\")","v":""},null,{"$f":"IFERROR(L102+1,\"\")","v":""},null,{"$f":"IFERROR(N102+1,\"\")","v":""},null,null,null,null,"Drifkostnader\nHit förs alla typer av driftkostnader (exklusive resekostnader) som är direkt förknippade med projektet. Detta kan innefatta för projektet nödvändig litteratur, kemikalier, laboratorieutrustning, konsultkostnader.\n\nBeloppet anges som en total kostnad för projektet på respektive rad sedan anges förbrukning av resursen (kostnden) för respektive år som procent. 100% innebär alltså att hela kostnaden tas på det året."]
[null,null,"Driftkostnader - beskrivning",null,null,null,"Kostnad att fördela ->","Förbr. %",{"$f":"IF($D$29=$D$30,\"inkl. index 0%\",\"inkl. index 1%\")","v":"inkl. index 1%"},"Förbr. %","inkl. index 1%","Förbr. %","inkl. index 1%","Förbr. %","inkl. index 1%","Förbr. %","inkl. index 1%"]
[null,null,"Instrument",null,null,null,null,null,{"$f":"IF(OR($D$29=\"\",$D$30=\"\"),\"År saknas\",(($G104)*H104)*((1+(MID(I$103,12,2))/100)^(H$102-$D$29)))","v":"År saknas"},null,{"$f":"IF(OR($D$29=\"\",$D$30=\"\"),\"År saknas\",(($G104)*J104)*((1+(MID(K$103,12,2))/100)^(J$102-$D$29)))","v":"År saknas"},null,{"$f":"IF(OR($D$29=\"\",$D$30=\"\"),\"År saknas\",(($G104)*L104)*((1+(MID(M$103,12,2))/100)^(L$102-$D$29)))","v":"År saknas"},null,{"$f":"IF(OR($D$29=\"\",$D$30=\"\"),\"År saknas\",(($G104)*N104)*((1+(MID(O$103,12,2))/100)^(N$102-$D$29)))","v":"År saknas"},null,{"$f":"IF(OR($D$29=\"\",$D$30=\"\"),\"År saknas\",(($G104)*P104)*((1+(MID(Q$103,12,2))/100)^(P$102-$D$29)))","v":"År saknas"}]
[null,null,"Konsulttid",null,null,null,null,null,"År saknas",null,"År saknas",null,"År saknas",null,"År saknas",null,"År saknas"]
[null,null,"Litteratur",null,null,null,null,null,"År saknas",null,"År saknas",null,"År saknas",null,"År saknas",null,"År saknas"]
[null,null,"Djur",null,null,null,null,null,"År saknas",null,"År saknas",null,"År saknas",null,"År saknas",null,"År saknas"]
[null,null,null,null,null,null,null,null,"År saknas",null,"År saknas",null,"År saknas",null,"År saknas",null,"År saknas"]
[null,null,null,null,null,null,null,null,"År saknas",null,"År saknas",null,"År saknas",null,"År saknas",null,"År saknas"]
[null,null,null,null,null,null,null,null,"År saknas",null,"År saknas",null,"År saknas",null,"År saknas",null,"År saknas"]
[null,null,null,null,null,null,null,null,"År saknas",null,"År saknas",null,"År saknas",null,"År saknas",null,"År saknas"]
[null,null,null,null,null,null,null,null,"År saknas",null,"År saknas",null,"År saknas",null,"År saknas",null,"År saknas"]
[]
[null,null,"Summa direkta driftkostnader",null,null,null,null,{"$f":"SUM(I$104:I112)","v":0},null,{"$f":"SUM(K$104:K112)","v":0},null,{"$f":"SUM(M$104:M112)","v":0},null,{"$f":"SUM(O$104:O112)","v":0},null,{"$f":"SUM(Q$104:Q112)","v":0}]
[null,null,null,null,null,null,null,null,null,null,null,null,null,null,null,null,null,null,null,null,"Övriga driftkostnader\nAvskrivningar, Lokalkostnader och interna kostnader genererar ingen INDI i den mån kalkylen inkluderar detta."]
[null,null,"B.3 Övriga driftkostnader (dessa exkluderas från INDI)"]
[]
[null,null,null,null,null,null,null,{"$f":"IF($D$30=\"\",\"\",IF($D$29>$D$30,\"Fel i grunduppgifter\",$D$30))","v":""},null,{"$f":"IFERROR(H118+1,\"\")","v":""},null,{"$f":"IFERROR(J118+1,\"\")","v":""},null,{"$f":"IFERROR(L118+1,\"\")","v":""},null,{"$f":"IFERROR(N118+1,\"\")","v":""}]
[null,null,"Anläggning - beskrivning",null,null,"Eko. livslängd","Investeringskostnad","Nyttj. %",{"$f":"IF($D$29=$D$30,\"inkl. index 0%\",\"inkl. index 0%\")","v":"inkl. index 0%"},"Nyttj. %","inkl. index 0%","Nyttj. %","inkl. index 0%","Nyttj. %","inkl. index 0%","Nyttj. %","inkl. index 0%",null,null,null,"\nAnläggningar\nAnge den kvarvarande ekonomiska livslängden och investeringskostnaden (nettofakturabelopp) eller totala restvärdet vid befintliga anläggningar. \nNyttjandegrad kan uppskattas eller beräknas genom att ta den totala tiden som anläggningen kommer nyttjas respektive år med den totala möjliga nyttjandetiden för anläggningen per år.\n\nLokalkostnader\nHit förs alla kostnader för de lokaler som nyttjas samt eventuella kostnader för städning och gemensamma ytor. Uppgifter om ytor och kostnd erhålls oftast från institutionens administration.\n\nInterna kostnader\nHit förs interna kostnader som uppstår av produkter eller tjänster som tillhandahålls från andra delar av KI, vilket ska inkludera motpartens indirekta kostnader (INDI)"]
[null,null,"Anl 1",null,null,null,null,null,{"$f":"IFERROR(IF((H$118-$D$30)>=((IF(LEN($F120)=4,LEFT($F120,1),LEFT($F120,2)))*1),\"*livslängd < proj-tid\",(($G120/(IF(LEN($F120)=4,LEFT($F120,1),LEFT($F120,2))))*H120)*((1+(MID(I$119,12,2))/100)^(H$118-$D$29))),0)","v":0},null,{"$f":"IFERROR(IF((J$118-$D$30)>=((IF(LEN($F120)=4,LEFT($F120,1),LEFT($F120,2)))*1),\"*livslängd < proj-tid\",(($G120/(IF(LEN($F120)=4,LEFT($F120,1),LEFT($F120,2))))*J120)*((1+(MID(K$119,12,2))/100)^(J$118-$D$29))),0)","v":0},null,{"$f":"IFERROR(IF((L$118-$D$30)>=((IF(LEN($F120)=4,LEFT($F120,1),LEFT($F120,2)))*1),\"*livslängd < proj-tid\",(($G120/(IF(LEN($F120)=4,LEFT($F120,1),LEFT($F120,2))))*L120)*((1+(MID(M$119,12,2))/100)^(L$118-$D$29))),0)","v":0},null,{"$f":"IFERROR(IF((N$118-$D$30)>=((IF(LEN($F120)=4,LEFT($F120,1),LEFT($F120,2)))*1),\"*livslängd < proj-tid\",(($G120/(IF(LEN($F120)=4,LEFT($F120,1),LEFT($F120,2))))*N120)*((1+(MID(O$119,12,2))/100)^(N$118-$D$29))),0)","v":0},null,{"$f":"IFERROR(IF((P$118-$D$30)>=((IF(LEN($F120)=4,LEFT($F120,1),LEFT($F120,2)))*1),\"*livslängd < proj-tid\",(($G120/(IF(LEN($F120)=4,LEFT($F120,1),LEFT($F120,2))))*P120)*((1+(MID(Q$119,12,2))/100)^(P$118-$D$29))),0)","v":0}]
[null,null,null,null,null,null,null,null,{"$f":"IFERROR(IF((H$118-$D$30)>=((IF(LEN($F121)=4,LEFT($F121,1),LEFT($F121,2)))*1),\"*livslängd < proj-tid\",(($G121/(IF(LEN($F121)=4,LEFT($F121,1),LEFT($F121,2))))*H121)*((1+(MID(I$119,12,2))/100)^(H$118-$D$29))),0)","v":0},null,{"$f":"IFERROR(IF((J$118-$D$30)>=((IF(LEN($F121)=4,LEFT($F121,1),LEFT($F121,2)))*1),\"*livslängd < proj-tid\",(($G121/(IF(LEN($F121)=4,LEFT($F121,1),LEFT($F121,2))))*J121)*((1+(MID(K$119,12,2))/100)^(J$118-$D$29))),0)","v":0},null,{"$f":"IFERROR(IF((L$118-$D$30)>=((IF(LEN($F121)=4,LEFT($F121,1),LEFT($F121,2)))*1),\"*livslängd < proj-tid\",(($G121/(IF(LEN($F121)=4,LEFT($F121,1),LEFT($F121,2))))*L121)*((1+(MID(M$119,12,2))/100)^(L$118-$D$29))),0)","v":0},null,{"$f":"IFERROR(IF((N$118-$D$30)>=((IF(LEN($F121)=4,LEFT($F121,1),LEFT($F121,2)))*1),\"*livslängd < proj-tid\",(($G121/(IF(LEN($F121)=4,LEFT($F121,1),LEFT($F121,2))))*N121)*((1+(MID(O$119,12,2))/100)^(N$118-$D$29))),0)","v":0},null,{"$f":"IFERROR(IF((P$118-$D$30)>=((IF(LEN($F121)=4,LEFT($F121,1),LEFT($F121,2)))*1),\"*livslängd < proj-tid\",(($G121/(IF(LEN($F121)=4,LEFT($F121,1),LEFT($F121,2))))*P121)*((1+(MID(Q$119,12,2))/100)^(P$118-$D$29))),0)","v":0}]
[]
[null,null,null,null,null,null,null,{"$f":"IF($D$30=\"\",\"\",IF($D$29>$D$30,\"Fel i grunduppgifter\",$D$30))","v":""},null,{"$f":"IFERROR(H123+1,\"\")","v":""},null,{"$f":"IFERROR(J123+1,\"\")","v":""},null,{"$f":"IFERROR(L123+1,\"\")","v":""},null,{"$f":"IFERROR(N123+1,\"\")","v":""}]
[null,null,"Lokalkostnader - beskrivning",null,null,"Lokal yta kvm","Kvm kostnad / år","Nyttj. %",{"$f":"IF($D$29=$D$30,\"inkl. index 0%\",\"inkl. index 2%\")","v":"inkl. index 2%"},"Nyttj. %","inkl. index 2%","Nyttj. %","inkl. index 2%","Nyttj. %","inkl. index 2%","Nyttj. %","inkl. index 2%"]
[null,null,"Kontor1",null,null,null,null,null,{"$f":"IF(OR($D$29=\"\",$D$30=\"\"),\"År saknas\",(($F125*$G125)*H125)*((1+(MID(I$124,12,2))/100)^(H$123-$D$29)))","v":"År saknas"},null,{"$f":"IF(OR($D$29=\"\",$D$30=\"\"),\"År saknas\",(($F125*$G125)*J125)*((1+(MID(K$124,12,2))/100)^(J$123-$D$29)))","v":"År saknas"},null,{"$f":"IF(OR($D$29=\"\",$D$30=\"\"),\"År saknas\",(($F125*$G125)*L125)*((1+(MID(M$124,12,2))/100)^(L$123-$D$29)))","v":"År saknas"},null,{"$f":"IF(OR($D$29=\"\",$D$30=\"\"),\"År saknas\",(($F125*$G125)*N125)*((1+(MID(O$124,12,2))/100)^(N$123-$D$29)))","v":"År saknas"},null,{"$f":"IF(OR($D$29=\"\",$D$30=\"\"),\"År saknas\",(($F125*$G125)*P125)*((1+(MID(Q$124,12,2))/100)^(P$123-$D$29)))","v":"År saknas"}]
[null,null,"Lab1",null,null,null,null,null,{"$f":"IF(OR($D$29=\"\",$D$30=\"\"),\"År saknas\",(($F126*$G126)*H126)*((1+(MID(I$124,12,2))/100)^(H$123-$D$29)))","v":"År saknas"},null,{"$f":"IF(OR($D$29=\"\",$D$30=\"\"),\"År saknas\",(($F126*$G126)*J126)*((1+(MID(K$124,12,2))/100)^(J$123-$D$29)))","v":"År saknas"},null,{"$f":"IF(OR($D$29=\"\",$D$30=\"\"),\"År saknas\",(($F126*$G126)*L126)*((1+(MID(M$124,12,2))/100)^(L$123-$D$29)))","v":"År saknas"},null,{"$f":"IF(OR($D$29=\"\",$D$30=\"\"),\"År saknas\",(($F126*$G126)*N126)*((1+(MID(O$124,12,2))/100)^(N$123-$D$29)))","v":"År saknas"},null,{"$f":"IF(OR($D$29=\"\",$D$30=\"\"),\"År saknas\",(($F126*$G126)*P126)*((1+(MID(Q$124,12,2))/100)^(P$123-$D$29)))","v":"År saknas"}]
[null,null,null,null,null,null,null,null,{"$f":"IF(OR($D$29=\"\",$D$30=\"\"),\"År saknas\",(($F127*$G127)*H127)*((1+(MID(I$124,12,2))/100)^(H$123-$D$29)))","v":"År saknas"},null,{"$f":"IF(OR($D$29=\"\",$D$30=\"\"),\"År saknas\",(($F127*$G127)*J127)*((1+(MID(K$124,12,2))/100)^(J$123-$D$29)))","v":"År saknas"},null,{"$f":"IF(OR($D$29=\"\",$D$30=\"\"),\"År saknas\",(($F127*$G127)*L127)*((1+(MID(M$124,12,2))/100)^(L$123-$D$29)))","v":"År saknas"},null,{"$f":"IF(OR($D$29=\"\",$D$30=\"\"),\"År saknas\",(($F127*$G127)*N127)*((1+(MID(O$124,12,2))/100)^(N$123-$D$29)))","v":"År saknas"},null,{"$f":"IF(OR($D$29=\"\",$D$30=\"\"),\"År saknas\",(($F127*$G127)*P127)*((1+(MID(Q$124,12,2))/100)^(P$123-$D$29)))","v":"År saknas"}]
[]
[null,null,null,null,null,null,null,{"$f":"IF($D$30=\"\",\"\",IF($D$29>$D$30,\"Fel i grunduppgifter\",$D$30))","v":""},null,{"$f":"IFERROR(H129+1,\"\")","v":""},null,{"$f":"IFERROR(J129+1,\"\")","v":""},null,{"$f":"IFERROR(L129+1,\"\")","v":""},null,{"$f":"IFERROR(N129+1,\"\")","v":""}]
[null,null,"Interna kostnader och eventuell INDI-befriad verksamhet - beskrivning",null,null,null,"Kostnad att fördela ->","Förbr. %",{"$f":"IF($D$29=$D$30,\"inkl. index 0%\",\"inkl. index 0%\")","v":"inkl. index 0%"},"Förbr. %","inkl. index 0%","Förbr. %","inkl. index 0%","Förbr. %","inkl. index 0%","Förbr. %","inkl. index 0%"]
[null,null,"Interntjänst1, inkl. motpartens INDI",null,null,null,null,null,{"$f":"IF(OR($D$29=\"\",$D$30=\"\"),\"År saknas\",(($G131)*H131)*((1+(MID(I$130,12,2))/100)^(H$129-$D$29)))","v":"År saknas"},null,{"$f":"IF(OR($D$29=\"\",$D$30=\"\"),\"År saknas\",(($G131)*J131)*((1+(MID(K$130,12,2))/100)^(J$129-$D$29)))","v":"År saknas"},null,{"$f":"IF(OR($D$29=\"\",$D$30=\"\"),\"År saknas\",(($G131)*L131)*((1+(MID(M$130,12,2))/100)^(L$129-$D$29)))","v":"År saknas"},null,{"$f":"IF(OR($D$29=\"\",$D$30=\"\"),\"År saknas\",(($G131)*N131)*((1+(MID(O$130,12,2))/100)^(N$129-$D$29)))","v":"År saknas"},null,{"$f":"IF(OR($D$29=\"\",$D$30=\"\"),\"År saknas\",(($G131)*P131)*((1+(MID(Q$130,12,2))/100)^(P$129-$D$29)))","v":"År saknas"}]
[null,null,"IT avgift 10 400 kr per anställd/anknuten och år (2022)",null,null,null,null,null,{"$f":"IF(OR($D$29=\"\",$D$30=\"\"),\"År saknas\",(($G132)*H132)*((1+(MID(I$130,12,2))/100)^(H$129-$D$29)))","v":"År saknas"},null,{"$f":"IF(OR($D$29=\"\",$D$30=\"\"),\"År saknas\",(($G132)*J132)*((1+(MID(K$130,12,2))/100)^(J$129-$D$29)))","v":"År saknas"},null,{"$f":"IF(OR($D$29=\"\",$D$30=\"\"),\"År saknas\",(($G132)*L132)*((1+(MID(M$130,12,2))/100)^(L$129-$D$29)))","v":"År saknas"},null,{"$f":"IF(OR($D$29=\"\",$D$30=\"\"),\"År saknas\",(($G132)*N132)*((1+(MID(O$130,12,2))/100)^(N$129-$D$29)))","v":"År saknas"},null,{"$f":"IF(OR($D$29=\"\",$D$30=\"\"),\"År saknas\",(($G132)*P132)*((1+(MID(Q$130,12,2))/100)^(P$129-$D$29)))","v":"År saknas"}]
[null,null,null,null,null,null,null,null,{"$f":"IF(OR($D$29=\"\",$D$30=\"\"),\"År saknas\",(($G133)*H133)*((1+(MID(I$130,12,2))/100)^(H$129-$D$29)))","v":"År saknas"},null,{"$f":"IF(OR($D$29=\"\",$D$30=\"\"),\"År saknas\",(($G133)*J133)*((1+(MID(K$130,12,2))/100)^(J$129-$D$29)))","v":"År saknas"},null,{"$f":"IF(OR($D$29=\"\",$D$30=\"\"),\"År saknas\",(($G133)*L133)*((1+(MID(M$130,12,2))/100)^(L$129-$D$29)))","v":"År saknas"},null,{"$f":"IF(OR($D$29=\"\",$D$30=\"\"),\"År saknas\",(($G133)*N133)*((1+(MID(O$130,12,2))/100)^(N$129-$D$29)))","v":"År saknas"},null,{"$f":"IF(OR($D$29=\"\",$D$30=\"\"),\"År saknas\",(($G133)*P133)*((1+(MID(Q$130,12,2))/100)^(P$129-$D$29)))","v":"År saknas"}]
[]
[null,null,"Summa Övriga kostnader",null,null,null,null,{"$f":"SUM(I$120:I121)+SUM(I$131:I133)+SUM(I$125:I127)","v":0},null,{"$f":"SUM(K$120:K121)+SUM(K$131:K133)+SUM(K$125:K127)","v":0},null,{"$f":"SUM(M$120:M121)+SUM(M$131:M133)+SUM(M$125:M127)","v":0},null,{"$f":"SUM(O$120:O121)+SUM(O$131:O133)+SUM(O$125:O127)","v":0},null,{"$f":"SUM(Q$120:Q121)+SUM(Q$131:Q133)+SUM(Q$125:Q127)","v":0}]
[]
[null,null,"Summa Driftkostnader",null,null,null,null,{"$f":"H135+H114+H98","v":0},null,{"$f":"J135+J114+J98","v":0},null,{"$f":"L135+L114+L98","v":0},null,{"$f":"N135+N114+N98","v":0},null,{"$f":"P135+P114+P98","v":0}]
[null,null,null,null,null,null,null,null,null,null,null,null,null,null,null,null,null,null,null,null,"Gemensamma kostnader\nIndirekta kostnader (INDI)\nDessa innefattar oftast universitets- och fakultetsgemensamma kostnader samt institutionsgemensamma kostnader.\n\nHär finns även möjlighet att göra ned- eller uppräkning av INDI (kan nyttjas vid flerårigt projekt)."]
[null,null,"C. Gemensamma kostnader"]
[null,null,{"$f":"IF(LEFT($D$28,2)=\"UF\",$D$28,\"Universitetsgem.\")","v":"Universitetsgem."},null,null,null,{"$f":"IF($D$28=\"\",0,IF(LEFT($D$28,2)=\"UF\",VLOOKUP($C$140,'INDI FO 2025'!$C:$G,5,0),VLOOKUP(LEFT($D$28,2),'INDI FO 2025'!$A:$G,6,0)))","v":0}]
[null,null,{"$f":"IF(LEFT($D$28,2)=\"UF\",\"\",\"Institutionsgem.\")","v":"Institutionsgem."},null,null,null,{"$f":"IF($D$28=\"\",0,IF(LEFT($D$28,2)=\"UF\",\"\",VLOOKUP(LEFT($D$28,2),'INDI FO 2025'!$A:$G,4,0)))","v":0}]
[null,null,"Ned- / Uppräkning av INDI",null,null,null,0]
[null,null,null,null,null,"INDI Total",{"$f":"SUM(G140:G142)","v":0}]
[]
[null,null,"Summa Indirekta kostnader",null,null,null,null,{"$f":"(H75+H114+H98)*$G$143","v":0},null,{"$f":"(J75+J114+J98)*$G$143","v":0},null,{"$f":"(L75+L114+L98)*$G$143","v":0},null,{"$f":"(N75+N114+N98)*$G$143","v":0},null,{"$f":"(P75+P114+P98)*$G$143","v":0}]
[]
[]
[null,null,"SUMMA PROJEKTKOSTNADER",null,null,null,null,{"$f":"H86+H137+H145","v":0},null,{"$f":"J86+J137+J145","v":0},null,{"$f":"L86+L137+L145","v":0},null,{"$f":"N86+N137+N145","v":0},null,{"$f":"P86+P137+P145","v":0}]
[]
[]
[null,null,"FINANSIERING",null,null,null,null,null,null,null,null,null,null,null,null,null,null,null,null,null,"Finansiering\nHär redogörs för finansiering av de förväntade kostnader\n\n\nHuvudfinansiär\nHär redogörs för den förväntade huvudfinansieringen av projektets kostnader. Detta är oftast en finansiär men kan givetvis innefatta flera finansieringskällor.\n\nHuvudfinansiärerna är till majoritet KI-externa organisationer och föreningar.\n\nI fritexfält kan vid behov formler nyttjas för beräkning då finansiering baserar sig på regler kopplade till andra kostnadsposter, exempelvis INDI."]
[]
[null,null,"A. Huvudfinansiär"]
[null,null,"Beviljad finansiering",null,null,"Frivillig rubrik","Frivillig rubrik",{"$f":"IF($D$30=\"\",\"\",IF($D$29>$D$30,\"Fel i grunduppgifter\",$D$30))","v":""},null,{"$f":"IFERROR(H154+1,\"\")","v":""},null,{"$f":"IFERROR(J154+1,\"\")","v":""},null,{"$f":"IFERROR(L154+1,\"\")","v":""},null,{"$f":"IFERROR(N154+1,\"\")","v":""}]
[null,null,"Finansiär1"]
[null,null,"Finansiär2"]
[]
[]
[null,null,"Summa finansiering",null,null,null,null,{"$f":"SUM(H155:I157)","v":0},null,{"$f":"SUM(J155:K157)","v":0},null,{"$f":"SUM(L155:M157)","v":0},null,{"$f":"SUM(N155:O157)","v":0},null,{"$f":"SUM(P155:Q157)","v":0}]
[]
[null,null,"B. Samfinansiering"]
[null,null,"Samfinansiering / kapital från projekt",null,null,"Frivillig rubrik","Frivillig rubrik",{"$f":"IF($D$30=\"\",\"\",IF($D$29>$D$30,\"Fel i grunduppgifter\",$D$30))","v":""},null,{"$f":"IFERROR(H162+1,\"\")","v":""},null,{"$f":"IFERROR(J162+1,\"\")","v":""},null,{"$f":"IFERROR(L162+1,\"\")","v":""},null,{"$f":"IFERROR(N162+1,\"\")","v":""},null,null,null,null,"Samfinansiering\nInnan något har förts in här visar totalen eller uträkningen längst ner samfinansieringsbehovet som finns. Dvs totalen av de kostnader som inte täcks av huvudfinansiären / -finansiärerna.\n\nEfter behovet av samfinansiering visats kan här redogöras för varifrån och i hur stor omfattning samfinansieringen som kommer, allt eftersom samfinansiering förs in reduseras samfinansieringsbehovet totalt i filen."]
[null,null,"Projekt1"]
[null,null,"Projekt2"]
[]
[]
[null,null,"Samfinansieringsbehov (finansiering - kostnader + samfinansiering)",null,null,null,null,{"$f":"H159-H148+SUM(H163:I164)","v":0},null,{"$f":"J159-J148+SUM(J163:K164)","v":0},null,{"$f":"L159-L148+SUM(L163:M164)","v":0},null,{"$f":"N159-N148+SUM(N163:O164)","v":0},null,{"$f":"P159-P148+SUM(P163:Q164)","v":0}]
[]
[null,null,"Huvudansökanden",null,"Kontrollerad av inst.-ekonom / motsvarande",null,"Prefekt / med motsvarande beslutsrätt"]
[]
[]
[null,null,"Signatur",null,"Signatur",null,"Signatur",null,null,null,null,null,null,null,null,null,null,null,null,null,"Underskrifter\nMallen ska alltid skrivas under av prefekt, eller av den till vilken prefekten delegerat beslutsrätten, när det ansökta bidraget överstiger 100 000 kr."]
[]
[]
[null,null,"Namnförtydligande",null,"Namnförtydligande",null,"Namnförtydligande"]

{"sheet":"Spec-indir-kostn-inst & -proj","index":7,"n_rows":78,"n_cols":9,"rows_kept":78,"cut":false,"hidden":false,"merged":[[15,3,15,4],[16,3,16,4],[25,2,25,3],[26,2,26,3],[2,1,7,10],[14,3,14,4],[27,2,27,3],[28,2,28,3],[29,2,29,3],[44,2,44,3],[18,2,18,3],[30,2,30,3],[31,2,31,3],[42,2,42,3],[36,2,36,3],[37,2,37,3],[38,2,38,3],[39,2,39,3],[40,2,40,3],[41,2,41,3]]}
[null,"BIDRAGSFORKSNING - BILAGA TILL FULL KOSTNADSTÄCKNINGSKALKYL"]
[]
[null,"Inledning\n\nDenna flik preciserar de gemensamma / indirekta kostnaderna (INDI) för myndigheten Karolinska Institutet, men även för utförande institution samt för det specifika projektet. Fördelningen görs på följande nivåer: Ledning, Utbildning-forskning, Ekonomi-personal, Infrastruktur-service, Bibliotek, Nivåspecifikt övrigt.\n\nSiffrorna i mallen hämtas automatiskt om uppgifterna i bidragsforksningsfliken är korrekt ifyllda."]
[]
[]
[]
[]
[]
[]
[]
[]
[null,null,"GRUNDLÄGGANDE UPPGIFTER"]
[]
[null,null,"Institutions kod",{"$f":"Bidragsforskning!$D$28","v":0}]
[null,null,"Projektledare/-ansvarig",{"$f":"IF(Bidragsforskning!$D32=\"\",\"\",Bidragsforskning!$D32)","v":""}]
[null,null,"Projektnummer - UBW",{"$f":"IF(Bidragsforskning!$D33=\"\",\"\",Bidragsforskning!$D33)","v":""}]
[null,null,"Beskrivnig av projektet",{"$f":"IF(Bidragsforskning!$D34=\"\",\"\",Bidragsforskning!$D34)","v":""}]
[]
[null,null,"Fördelningsbas kostnadsunderlag i tkr:",null,{"$f":"IF(Bidragsforskning!$D$28=\"\",\"\",VLOOKUP(LEFT(Bidragsforskning!$D$28,2),'INDI FO 2025'!K1:M26,3,0))","v":""}]
[]
[]
[null,null,"INDIREKTA KOSTNADER KAROLINSKA INSTITUTET I TUSENTALS KR (KSEK)"]
[]
[]
[null,null,null,null,"Universitetsgem\nkostnader - totalt","Institutionsgem\nkostnader - totalt"]
[null,null,"Ledning",null,80104,{"$f":"SUMIF('INDI FO 2025'!$R$36:$R$45,'Spec-indir-kostn-inst & -proj'!$C26,'INDI FO 2025'!$T$36:$T$45)/-1000","v":0}]
[null,null,"Utbildning-forskning",null,131527,{"$f":"SUMIF('INDI FO 2025'!$R$36:$R$45,'Spec-indir-kostn-inst & -proj'!$C27,'INDI FO 2025'!$T$36:$T$45)/-1000","v":0}]
[null,null,"Ekonomi-personal",null,82512,{"$f":"SUMIF('INDI FO 2025'!$R$36:$R$45,'Spec-indir-kostn-inst & -proj'!$C28,'INDI FO 2025'!$T$36:$T$45)/-1000","v":0}]
[null,null,"Infrastruktur-service",null,123183,{"$f":"SUMIF('INDI FO 2025'!$R$36:$R$45,'Spec-indir-kostn-inst & -proj'!$C29,'INDI FO 2025'!$T$36:$T$45)/-1000","v":0}]
[null,null,"Bibliotek",null,75731,{"$f":"SUMIF('INDI FO 2025'!$R$36:$R$45,'Spec-indir-kostn-inst & -proj'!$C30,'INDI FO 2025'!$T$36:$T$45)/-1000","v":0}]
[null,null,"Nivåspecifikt mm",null,0,{"$f":"SUMIF('INDI FO 2025'!$R$36:$R$45,'Spec-indir-kostn-inst & -proj'!$C31,'INDI FO 2025'!$T$36:$T$45)/-1000","v":0}]
[null,null,"Summa",null,{"$f":"SUM(E26:E31)","v":493057},{"$f":"SUM(F26:F31)","v":0}]
[]
[]
[null,null,null,null,"Inst andel av\nUniversitetsgem","Inst andel av\nInstitutionsgem","Totalt indirekta kostnader för Inst","% andel av total INDI för Inst"]
[null,null,null,null,{"$f":"IF(Bidragsforskning!$D$28=\"\",\"\",E43/E32)","v":""},{"$f":"IF(Bidragsforskning!$D$28=\"\",\"\",100%)","v":""}]
[null,null,"Ledning",null,{"$f":"IF(E$36=\"\",\"\",E$36*E26)","v":""},{"$f":"IF(Bidragsforskning!$D$28=\"\",\"\",F26*F$36)","v":""},{"$f":"IF(Bidragsforskning!$D$28=\"\",\"\",E37+F37)","v":""},{"$f":"IF(Bidragsforskning!$D$28=\"\",\"\",(IF(G37=0,0,G37/E$19)))","v":""}]
[null,null,"Utbildning-forskning",null,"",{"$f":"IF(Bidragsforskning!$D$28=\"\",\"\",F27*F$36)","v":""},{"$f":"IF(Bidragsforskning!$D$28=\"\",\"\",E38+F38)","v":""},{"$f":"IF(Bidragsforskning!$D$28=\"\",\"\",(IF(G38=0,0,G38/E$19)))","v":""}]
[null,null,"Ekonomi-personal",null,"",{"$f":"IF(Bidragsforskning!$D$28=\"\",\"\",F28*F$36)","v":""},{"$f":"IF(Bidragsforskning!$D$28=\"\",\"\",E39+F39)","v":""},{"$f":"IF(Bidragsforskning!$D$28=\"\",\"\",(IF(G39=0,0,G39/E$19)))","v":""}]
[null,null,"Infrastruktur-service",null,"",{"$f":"IF(Bidragsforskning!$D$28=\"\",\"\",F29*F$36)","v":""},{"$f":"IF(Bidragsforskning!$D$28=\"\",\"\",E40+F40)","v":""},{"$f":"IF(Bidragsforskning!$D$28=\"\",\"\",(IF(G40=0,0,G40/E$19)))","v":""}]
[null,null,"Bibliotek",null,"",{"$f":"IF(Bidragsforskning!$D$28=\"\",\"\",F30*F$36)","v":""},{"$f":"IF(Bidragsforskning!$D$28=\"\",\"\",E41+F41)","v":""},{"$f":"IF(Bidragsforskning!$D$28=\"\",\"\",(IF(G41=0,0,G41/E$19)))","v":""}]
[null,null,"Nivåspecifikt mm",null,"",{"$f":"IF(Bidragsforskning!$D$28=\"\",\"\",F31*F$36)","v":""},{"$f":"IF(Bidragsforskning!$D$28=\"\",\"\",E42+F42)","v":""},{"$f":"IF(Bidragsforskning!$D$28=\"\",\"\",(IF(G42=0,0,G42/E$19)))","v":""}]
[null,null,"Summa",null,{"$f":"IF(Bidragsforskning!$D$28=\"\",\"\",VLOOKUP(LEFT(Bidragsforskning!$D$28,2),'INDI FO 2025'!K1:O26,4,0))","v":""},{"$f":"IF(Bidragsforskning!$D$28=\"\",\"\",VLOOKUP(LEFT(Bidragsforskning!$D$28,2),'INDI FO 2025'!K1:P26,8,0))","v":""},{"$f":"SUM(G37:G42)","v":0},{"$f":"SUM(H37:H42)","v":0}]
[]
[null,null,"Andel av total fördelningsbas",null,{"$f":"IF(Bidragsforskning!$D$28=\"\",\"\",E43/$E$19)","v":""},{"$f":"IF(Bidragsforskning!$D$28=\"\",\"\",F43/$E$19)","v":""},{"$f":"ROUND(SUM(E45:F45),4)","v":0},{"$f":"IF(AND(ROUND(SUM(H37:H42),4)=G45,G45=(ROUND(VLOOKUP(LEFT(Bidragsforskning!D28,2),'INDI FO 2025'!A2:G26,7,0),4))),\"VARIABEL CHECK - OK\",\"CONTACT EA\")","v":{"$error":"#N/A"}}]
[null,null,"(Löner och drift; exklusive avskr, lokal och interna -kostnader)"]
[]
[]
[null,null,"INDIREKTA KOSTNADER FÖR SPECIFIKT PROJEKT I HELA KR (SEK)"]
[]
[]
[null,null,null,null,{"$f":"Bidragsforskning!H40","v":""},{"$f":"IFERROR(E52+1,\"\")","v":""},{"$f":"IFERROR(F52+1,\"\")","v":""},{"$f":"IFERROR(G52+1,\"\")","v":""},{"$f":"IFERROR(H52+1,\"\")","v":""}]
[null,null,"Proj. andel av Universitetsgem"]
[null,null,"Ledning",{"$f":"IF(Bidragsforskning!$D$28=\"\",0,(E37/$E$19)/$G$45)","v":0},{"$f":"IF(Bidragsforskning!$D$28=\"\",0,$D54*Bidragsforskning!H$145)","v":0},{"$f":"IF(Bidragsforskning!$D$28=\"\",0,$D54*Bidragsforskning!J$145)","v":0},{"$f":"IF(Bidragsforskning!$D$28=\"\",0,$D54*Bidragsforskning!L$145)","v":0},{"$f":"IF(Bidragsforskning!$D$28=\"\",0,$D54*Bidragsforskning!N$145)","v":0},{"$f":"IF(Bidragsforskning!$D$28=\"\",0,$D54*Bidragsforskning!P$145)","v":0}]
[null,null,"Utbildning-forskning",{"$f":"IF(Bidragsforskning!$D$28=\"\",0,(E38/$E$19)/$G$45)","v":0},{"$f":"IF(Bidragsforskning!$D$28=\"\",0,$D55*Bidragsforskning!H$145)","v":0},{"$f":"IF(Bidragsforskning!$D$28=\"\",0,$D55*Bidragsforskning!J$145)","v":0},{"$f":"IF(Bidragsforskning!$D$28=\"\",0,$D55*Bidragsforskning!L$145)","v":0},{"$f":"IF(Bidragsforskning!$D$28=\"\",0,$D55*Bidragsforskning!N$145)","v":0},{"$f":"IF(Bidragsforskning!$D$28=\"\",0,$D55*Bidragsforskning!P$145)","v":0}]
[null,null,"Ekonomi-personal",{"$f":"IF(Bidragsforskning!$D$28=\"\",0,(E39/$E$19)/$G$45)","v":0},{"$f":"IF(Bidragsforskning!$D$28=\"\",0,$D56*Bidragsforskning!H$145)","v":0},{"$f":"IF(Bidragsforskning!$D$28=\"\",0,$D56*Bidragsforskning!J$145)","v":0},{"$f":"IF(Bidragsforskning!$D$28=\"\",0,$D56*Bidragsforskning!L$145)","v":0},{"$f":"IF(Bidragsforskning!$D$28=\"\",0,$D56*Bidragsforskning!N$145)","v":0},{"$f":"IF(Bidragsforskning!$D$28=\"\",0,$D56*Bidragsforskning!P$145)","v":0}]
[null,null,"Infrastruktur-service",{"$f":"IF(Bidragsforskning!$D$28=\"\",0,(E40/$E$19)/$G$45)","v":0},{"$f":"IF(Bidragsforskning!$D$28=\"\",0,$D57*Bidragsforskning!H$145)","v":0},{"$f":"IF(Bidragsforskning!$D$28=\"\",0,$D57*Bidragsforskning!J$145)","v":0},{"$f":"IF(Bidragsforskning!$D$28=\"\",0,$D57*Bidragsforskning!L$145)","v":0},{"$f":"IF(Bidragsforskning!$D$28=\"\",0,$D57*Bidragsforskning!N$145)","v":0},{"$f":"IF(Bidragsforskning!$D$28=\"\",0,$D57*Bidragsforskning!P$145)","v":0}]
[null,null,"Bibliotek",{"$f":"IF(Bidragsforskning!$D$28=\"\",0,(E41/$E$19)/$G$45)","v":0},{"$f":"IF(Bidragsforskning!$D$28=\"\",0,$D58*Bidragsforskning!H$145)","v":0},{"$f":"IF(Bidragsforskning!$D$28=\"\",0,$D58*Bidragsforskning!J$145)","v":0},{"$f":"IF(Bidragsforskning!$D$28=\"\",0,$D58*Bidragsforskning!L$145)","v":0},{"$f":"IF(Bidragsforskning!$D$28=\"\",0,$D58*Bidragsforskning!N$145)","v":0},{"$f":"IF(Bidragsforskning!$D$28=\"\",0,$D58*Bidragsforskning!P$145)","v":0}]
[null,null,"Nivåspecifikt mm",{"$f":"IF(Bidragsforskning!$D$28=\"\",0,(E42/$E$19)/$G$45)","v":0},{"$f":"IF(Bidragsforskning!$D$28=\"\",0,$D59*Bidragsforskning!H$145)","v":0},{"$f":"IF(Bidragsforskning!$D$28=\"\",0,$D59*Bidragsforskning!J$145)","v":0},{"$f":"IF(Bidragsforskning!$D$28=\"\",0,$D59*Bidragsforskning!L$145)","v":0},{"$f":"IF(Bidragsforskning!$D$28=\"\",0,$D59*Bidragsforskning!N$145)","v":0},{"$f":"IF(Bidragsforskning!$D$28=\"\",0,$D59*Bidragsforskning!P$145)","v":0}]
[null,null,"Summa",{"$f":"IF(Bidragsforskning!$D$28=\"\",0,(E43/$E$19)/$G$45)","v":0},{"$f":"SUM(E54:E59)","v":0},{"$f":"SUM(F54:F59)","v":0},{"$f":"SUM(G54:G59)","v":0},{"$f":"SUM(H54:H59)","v":0},{"$f":"SUM(I54:I59)","v":0}]
[]
[null,null,"Proj. andel av Institutionsgem"]
[null,null,"Ledning",{"$f":"IF(Bidragsforskning!$D$28=\"\",0,(F37/$E$19)/$G$45)","v":0},{"$f":"IF(Bidragsforskning!$D$28=\"\",0,$D63*Bidragsforskning!H$145)","v":0},{"$f":"IF(Bidragsforskning!$D$28=\"\",0,$D63*Bidragsforskning!J$145)","v":0},{"$f":"IF(Bidragsforskning!$D$28=\"\",0,$D63*Bidragsforskning!L$145)","v":0},{"$f":"IF(Bidragsforskning!$D$28=\"\",0,$D63*Bidragsforskning!N$145)","v":0},{"$f":"IF(Bidragsforskning!$D$28=\"\",0,$D63*Bidragsforskning!P$145)","v":0}]
[null,null,"Utbildning-forskning",{"$f":"IF(Bidragsforskning!$D$28=\"\",0,(F38/$E$19)/$G$45)","v":0},{"$f":"IF(Bidragsforskning!$D$28=\"\",0,$D64*Bidragsforskning!H$145)","v":0},{"$f":"IF(Bidragsforskning!$D$28=\"\",0,$D64*Bidragsforskning!J$145)","v":0},{"$f":"IF(Bidragsforskning!$D$28=\"\",0,$D64*Bidragsforskning!L$145)","v":0},{"$f":"IF(Bidragsforskning!$D$28=\"\",0,$D64*Bidragsforskning!N$145)","v":0},{"$f":"IF(Bidragsforskning!$D$28=\"\",0,$D64*Bidragsforskning!P$145)","v":0}]
[null,null,"Ekonomi-personal",{"$f":"IF(Bidragsforskning!$D$28=\"\",0,(F39/$E$19)/$G$45)","v":0},{"$f":"IF(Bidragsforskning!$D$28=\"\",0,$D65*Bidragsforskning!H$145)","v":0},{"$f":"IF(Bidragsforskning!$D$28=\"\",0,$D65*Bidragsforskning!J$145)","v":0},{"$f":"IF(Bidragsforskning!$D$28=\"\",0,$D65*Bidragsforskning!L$145)","v":0},{"$f":"IF(Bidragsforskning!$D$28=\"\",0,$D65*Bidragsforskning!N$145)","v":0},{"$f":"IF(Bidragsforskning!$D$28=\"\",0,$D65*Bidragsforskning!P$145)","v":0}]
[null,null,"Infrastruktur-service",{"$f":"IF(Bidragsforskning!$D$28=\"\",0,(F40/$E$19)/$G$45)","v":0},{"$f":"IF(Bidragsforskning!$D$28=\"\",0,$D66*Bidragsforskning!H$145)","v":0},{"$f":"IF(Bidragsforskning!$D$28=\"\",0,$D66*Bidragsforskning!J$145)","v":0},{"$f":"IF(Bidragsforskning!$D$28=\"\",0,$D66*Bidragsforskning!L$145)","v":0},{"$f":"IF(Bidragsforskning!$D$28=\"\",0,$D66*Bidragsforskning!N$145)","v":0},{"$f":"IF(Bidragsforskning!$D$28=\"\",0,$D66*Bidragsforskning!P$145)","v":0}]
[null,null,"Bibliotek",{"$f":"IF(Bidragsforskning!$D$28=\"\",0,(F41/$E$19)/$G$45)","v":0},{"$f":"IF(Bidragsforskning!$D$28=\"\",0,$D67*Bidragsforskning!H$145)","v":0},{"$f":"IF(Bidragsforskning!$D$28=\"\",0,$D67*Bidragsforskning!J$145)","v":0},{"$f":"IF(Bidragsforskning!$D$28=\"\",0,$D67*Bidragsforskning!L$145)","v":0},{"$f":"IF(Bidragsforskning!$D$28=\"\",0,$D67*Bidragsforskning!N$145)","v":0},{"$f":"IF(Bidragsforskning!$D$28=\"\",0,$D67*Bidragsforskning!P$145)","v":0}]
[null,null,"Nivåspecifikt mm",{"$f":"IF(Bidragsforskning!$D$28=\"\",0,(F42/$E$19)/$G$45)","v":0},{"$f":"IF(Bidragsforskning!$D$28=\"\",0,$D68*Bidragsforskning!H$145)","v":0},{"$f":"IF(Bidragsforskning!$D$28=\"\",0,$D68*Bidragsforskning!J$145)","v":0},{"$f":"IF(Bidragsforskning!$D$28=\"\",0,$D68*Bidragsforskning!L$145)","v":0},{"$f":"IF(Bidragsforskning!$D$28=\"\",0,$D68*Bidragsforskning!N$145)","v":0},{"$f":"IF(Bidragsforskning!$D$28=\"\",0,$D68*Bidragsforskning!P$145)","v":0}]
[null,null,"Summa",{"$f":"IF(Bidragsforskning!$D$28=\"\",0,(F43/$E$19)/$G$45)","v":0},{"$f":"SUM(E63:E68)","v":0},{"$f":"SUM(F63:F68)","v":0},{"$f":"SUM(G63:G68)","v":0},{"$f":"SUM(H63:H68)","v":0},{"$f":"SUM(I63:I68)","v":0}]
[]
[null,null,"Proj. total indirekta kost "]
[null,null,"Ledning",{"$f":"IF(Bidragsforskning!$D$28=\"\",0,(G37/$E$19)/$G$45)","v":0},{"$f":"IF(Bidragsforskning!$D$28=\"\",0,$D72*Bidragsforskning!H$145)","v":0},{"$f":"IF(Bidragsforskning!$D$28=\"\",0,$D72*Bidragsforskning!J$145)","v":0},{"$f":"IF(Bidragsforskning!$D$28=\"\",0,$D72*Bidragsforskning!L$145)","v":0},{"$f":"IF(Bidragsforskning!$D$28=\"\",0,$D72*Bidragsforskning!N$145)","v":0},{"$f":"IF(Bidragsforskning!$D$28=\"\",0,$D72*Bidragsforskning!P$145)","v":0}]
[null,null,"Utbildning-forskning",{"$f":"IF(Bidragsforskning!$D$28=\"\",0,(G38/$E$19)/$G$45)","v":0},{"$f":"IF(Bidragsforskning!$D$28=\"\",0,$D73*Bidragsforskning!H$145)","v":0},{"$f":"IF(Bidragsforskning!$D$28=\"\",0,$D73*Bidragsforskning!J$145)","v":0},{"$f":"IF(Bidragsforskning!$D$28=\"\",0,$D73*Bidragsforskning!L$145)","v":0},{"$f":"IF(Bidragsforskning!$D$28=\"\",0,$D73*Bidragsforskning!N$145)","v":0},{"$f":"IF(Bidragsforskning!$D$28=\"\",0,$D73*Bidragsforskning!P$145)","v":0}]
[null,null,"Ekonomi-personal",{"$f":"IF(Bidragsforskning!$D$28=\"\",0,(G39/$E$19)/$G$45)","v":0},{"$f":"IF(Bidragsforskning!$D$28=\"\",0,$D74*Bidragsforskning!H$145)","v":0},{"$f":"IF(Bidragsforskning!$D$28=\"\",0,$D74*Bidragsforskning!J$145)","v":0},{"$f":"IF(Bidragsforskning!$D$28=\"\",0,$D74*Bidragsforskning!L$145)","v":0},{"$f":"IF(Bidragsforskning!$D$28=\"\",0,$D74*Bidragsforskning!N$145)","v":0},{"$f":"IF(Bidragsforskning!$D$28=\"\",0,$D74*Bidragsforskning!P$145)","v":0}]
[null,null,"Infrastruktur-service",{"$f":"IF(Bidragsforskning!$D$28=\"\",0,(G40/$E$19)/$G$45)","v":0},{"$f":"IF(Bidragsforskning!$D$28=\"\",0,$D75*Bidragsforskning!H$145)","v":0},{"$f":"IF(Bidragsforskning!$D$28=\"\",0,$D75*Bidragsforskning!J$145)","v":0},{"$f":"IF(Bidragsforskning!$D$28=\"\",0,$D75*Bidragsforskning!L$145)","v":0},{"$f":"IF(Bidragsforskning!$D$28=\"\",0,$D75*Bidragsforskning!N$145)","v":0},{"$f":"IF(Bidragsforskning!$D$28=\"\",0,$D75*Bidragsforskning!P$145)","v":0}]
[null,null,"Bibliotek",{"$f":"IF(Bidragsforskning!$D$28=\"\",0,(G41/$E$19)/$G$45)","v":0},{"$f":"IF(Bidragsforskning!$D$28=\"\",0,$D76*Bidragsforskning!H$145)","v":0},{"$f":"IF(Bidragsforskning!$D$28=\"\",0,$D76*Bidragsforskning!J$145)","v":0},{"$f":"IF(Bidragsforskning!$D$28=\"\",0,$D76*Bidragsforskning!L$145)","v":0},{"$f":"IF(Bidragsforskning!$D$28=\"\",0,$D76*Bidragsforskning!N$145)","v":0},{"$f":"IF(Bidragsforskning!$D$28=\"\",0,$D76*Bidragsforskning!P$145)","v":0}]
[null,null,"Nivåspecifikt mm",{"$f":"IF(Bidragsforskning!$D$28=\"\",0,(G42/$E$19)/$G$45)","v":0},{"$f":"IF(Bidragsforskning!$D$28=\"\",0,$D77*Bidragsforskning!H$145)","v":0},{"$f":"IF(Bidragsforskning!$D$28=\"\",0,$D77*Bidragsforskning!J$145)","v":0},{"$f":"IF(Bidragsforskning!$D$28=\"\",0,$D77*Bidragsforskning!L$145)","v":0},{"$f":"IF(Bidragsforskning!$D$28=\"\",0,$D77*Bidragsforskning!N$145)","v":0},{"$f":"IF(Bidragsforskning!$D$28=\"\",0,$D77*Bidragsforskning!P$145)","v":0}]
[null,null,"Summa",{"$f":"IF(Bidragsforskning!$D$28=\"\",0,(G43/$E$19)/$G$45)","v":0},{"$f":"SUM(E72:E77)","v":0},{"$f":"SUM(F72:F77)","v":0},{"$f":"SUM(G72:G77)","v":0},{"$f":"SUM(H72:H77)","v":0},{"$f":"SUM(I72:I77)","v":0}]

{"sheet":"Inläsning Planner","index":8,"n_rows":66,"n_cols":9,"rows_kept":66,"cut":false,"hidden":true,"merged":[[2,1,8,9]]}
[null,"BIDRAGSFORSKNING - STÖD FÖR BUDGET TILL UBW"]
[]
[null,"Inledning\n\nDenna flik summerar kostnader och intäkter som fyllts in i kalkylfliken och återvisar dem i en budgetmodell som enkelt kan föras in i Planner i UBW med hjälp av inläsningsmall. Posterna till olika konton hämtas beroende på vad som fyllts i under respektive rubrik i kalkylen. \n\nNedan finns två alternativ som kan nyttjas för uppföljning i UBW. Det första som återfinns under rubiken TOTAL BUDGET summerar samtliga intäkter och kostnader för projektet, och det andra som återfinns under rubriken ÅRSFÖRDELAD BUDGET fördelarar intäkter och kostnader på respektive år.\n\n"]
[]
[]
[]
[]
[]
[]
[]
[]
[null,null,"TOTAL BUDGET"]
[]
[null,null,"Beskrivning","Konto","Proj","Per från","Per till","Budget (BB)","Text"]
[null,null,"Intäkter av bidrag",3511,{"$f":"IF(Bidragsforskning!$D$33=\"\",\"Ange projektnummer\",Bidragsforskning!$D$33)","v":"Ange projektnummer"},{"$f":"IF(OR(Bidragsforskning!$D$30=\"\",Bidragsforskning!$E$30=\"\"),\"Ange start år/månad\",Bidragsforskning!$D$30&Bidragsforskning!$E$30)","v":"Ange start år/månad"},{"$f":"IF(OR(Bidragsforskning!$D$31=\"\",Bidragsforskning!$E$31=\"\"),\"Ange slut år/månad\",Bidragsforskning!$D$31&Bidragsforskning!$E$31)","v":"Ange slut år/månad"},{"$f":"H27+H35+H43+H51+H59","v":0},{"$f":"\"Budget totalt \"&Bidragsforskning!$D$33&\"\"","v":"Budget totalt "}]
[null,null,"Personalkostnader",4011,{"$f":"IF(Bidragsforskning!$D$33=\"\",\"Ange projektnummer\",Bidragsforskning!$D$33)","v":"Ange projektnummer"},{"$f":"IF(OR(Bidragsforskning!$D$30=\"\",Bidragsforskning!$E$30=\"\"),\"Ange start år/månad\",Bidragsforskning!$D$30&Bidragsforskning!$E$30)","v":"Ange start år/månad"},{"$f":"IF(OR(Bidragsforskning!$D$31=\"\",Bidragsforskning!$E$31=\"\"),\"Ange slut år/månad\",Bidragsforskning!$D$31&Bidragsforskning!$E$31)","v":"Ange slut år/månad"},0,{"$f":"\"Budget totalt \"&Bidragsforskning!$D$33&\"\"","v":"Budget totalt "}]
[null,null,"Gemensamma kostnader (INDI)",49988,{"$f":"IF(Bidragsforskning!$D$33=\"\",\"Ange projektnummer\",Bidragsforskning!$D$33)","v":"Ange projektnummer"},{"$f":"IF(OR(Bidragsforskning!$D$30=\"\",Bidragsforskning!$E$30=\"\"),\"Ange start år/månad\",Bidragsforskning!$D$30&Bidragsforskning!$E$30)","v":"Ange start år/månad"},{"$f":"IF(OR(Bidragsforskning!$D$31=\"\",Bidragsforskning!$E$31=\"\"),\"Ange slut år/månad\",Bidragsforskning!$D$31&Bidragsforskning!$E$31)","v":"Ange slut år/månad"},0,{"$f":"\"Budget totalt \"&Bidragsforskning!$D$33&\"\"","v":"Budget totalt "}]
[null,null,"Lokalkostnader",50111,{"$f":"IF(Bidragsforskning!$D$33=\"\",\"Ange projektnummer\",Bidragsforskning!$D$33)","v":"Ange projektnummer"},{"$f":"IF(OR(Bidragsforskning!$D$30=\"\",Bidragsforskning!$E$30=\"\"),\"Ange start år/månad\",Bidragsforskning!$D$30&Bidragsforskning!$E$30)","v":"Ange start år/månad"},{"$f":"IF(OR(Bidragsforskning!$D$31=\"\",Bidragsforskning!$E$31=\"\"),\"Ange slut år/månad\",Bidragsforskning!$D$31&Bidragsforskning!$E$31)","v":"Ange slut år/månad"},0,{"$f":"\"Budget totalt \"&Bidragsforskning!$D$33&\"\"","v":"Budget totalt "}]
[null,null,"Resekostnader",5522,{"$f":"IF(Bidragsforskning!$D$33=\"\",\"Ange projektnummer\",Bidragsforskning!$D$33)","v":"Ange projektnummer"},{"$f":"IF(OR(Bidragsforskning!$D$30=\"\",Bidragsforskning!$E$30=\"\"),\"Ange start år/månad\",Bidragsforskning!$D$30&Bidragsforskning!$E$30)","v":"Ange start år/månad"},{"$f":"IF(OR(Bidragsforskning!$D$31=\"\",Bidragsforskning!$E$31=\"\"),\"Ange slut år/månad\",Bidragsforskning!$D$31&Bidragsforskning!$E$31)","v":"Ange slut år/månad"},0,{"$f":"\"Budget totalt \"&Bidragsforskning!$D$33&\"\"","v":"Budget totalt "}]
[null,null,"Övriga driftskostnader",5797,{"$f":"IF(Bidragsforskning!$D$33=\"\",\"Ange projektnummer\",Bidragsforskning!$D$33)","v":"Ange projektnummer"},{"$f":"IF(OR(Bidragsforskning!$D$30=\"\",Bidragsforskning!$E$30=\"\"),\"Ange start år/månad\",Bidragsforskning!$D$30&Bidragsforskning!$E$30)","v":"Ange start år/månad"},{"$f":"IF(OR(Bidragsforskning!$D$31=\"\",Bidragsforskning!$E$31=\"\"),\"Ange slut år/månad\",Bidragsforskning!$D$31&Bidragsforskning!$E$31)","v":"Ange slut år/månad"},0,{"$f":"\"Budget totalt \"&Bidragsforskning!$D$33&\"\"","v":"Budget totalt "}]
[null,null,"Interna kostnader ",57849,{"$f":"IF(Bidragsforskning!$D$33=\"\",\"Ange projektnummer\",Bidragsforskning!$D$33)","v":"Ange projektnummer"},{"$f":"IF(OR(Bidragsforskning!$D$30=\"\",Bidragsforskning!$E$30=\"\"),\"Ange start år/månad\",Bidragsforskning!$D$30&Bidragsforskning!$E$30)","v":"Ange start år/månad"},{"$f":"IF(OR(Bidragsforskning!$D$31=\"\",Bidragsforskning!$E$31=\"\"),\"Ange slut år/månad\",Bidragsforskning!$D$31&Bidragsforskning!$E$31)","v":"Ange slut år/månad"},0,{"$f":"\"Budget totalt \"&Bidragsforskning!$D$33&\"\"","v":"Budget totalt "}]
[null,null,"Avskrivningar",6911,{"$f":"IF(Bidragsforskning!$D$33=\"\",\"Ange projektnummer\",Bidragsforskning!$D$33)","v":"Ange projektnummer"},{"$f":"IF(OR(Bidragsforskning!$D$30=\"\",Bidragsforskning!$E$30=\"\"),\"Ange start år/månad\",Bidragsforskning!$D$30&Bidragsforskning!$E$30)","v":"Ange start år/månad"},{"$f":"IF(OR(Bidragsforskning!$D$31=\"\",Bidragsforskning!$E$31=\"\"),\"Ange slut år/månad\",Bidragsforskning!$D$31&Bidragsforskning!$E$31)","v":"Ange slut år/månad"},0,{"$f":"\"Budget totalt \"&Bidragsforskning!$D$33&\"\"","v":"Budget totalt "}]
[]
[null,null,"ÅRSFÖRDELAD BUDGET"]
[]
[null,null,"Beskrivning","Konto","Proj","Per från","Per till","Budget (BB)","Text"]
[null,null,"Intäkter av bidrag",3511,{"$f":"IF(Bidragsforskning!$D$33=\"\",\"Ange projektnummer\",Bidragsforskning!$D$33)","v":"Ange projektnummer"},{"$f":"IF(OR(Bidragsforskning!$D$30=\"\",Bidragsforskning!$E$30=\"\"),\"Ange start år/månad\",Bidragsforskning!$D$30&Bidragsforskning!$E$30)","v":"Ange start år/månad"},{"$f":"IF(OR(Bidragsforskning!$D$30=\"\",Bidragsforskning!$E$31=\"\"),\"Ange slut år/månad\",IF(_xlfn.NUMBERVALUE(Bidragsforskning!$D$30)=Bidragsforskning!$D$31,Bidragsforskning!$D$30&Bidragsforskning!$E$31,Bidragsforskning!$D$30&\"12\"))","v":"Ange slut år/månad"},{"$f":"Bidragsforskning!H$159*-1","v":0},{"$f":"IF(OR(Bidragsforskning!$D$30=\"\",Bidragsforskning!$E$30=\"\"),\"\",IF(Bidragsforskning!$D$33=\"\",\"\",\"Budget \"&Bidragsforskning!$D$33&\" \"&Bidragsforskning!H$40))","v":""}]
[null,null,"Personalkostnader",4011,{"$f":"IF(Bidragsforskning!$D$33=\"\",\"Ange projektnummer\",Bidragsforskning!$D$33)","v":"Ange projektnummer"},{"$f":"IF(OR(Bidragsforskning!$D$30=\"\",Bidragsforskning!$E$30=\"\"),\"Ange start år/månad\",Bidragsforskning!$D$30&Bidragsforskning!$E$30)","v":"Ange start år/månad"},{"$f":"IF(OR(Bidragsforskning!$D$30=\"\",Bidragsforskning!$E$31=\"\"),\"Ange slut år/månad\",IF(_xlfn.NUMBERVALUE(Bidragsforskning!$D$30)=Bidragsforskning!$D$31,Bidragsforskning!$D$30&Bidragsforskning!$E$31,Bidragsforskning!$D$30&\"12\"))","v":"Ange slut år/månad"},{"$f":"Bidragsforskning!H$86","v":0},{"$f":"IF(OR(Bidragsforskning!$D$30=\"\",Bidragsforskning!$E$30=\"\"),\"\",IF(Bidragsforskning!$D$33=\"\",\"\",\"Budget \"&Bidragsforskning!$D$33&\" \"&Bidragsforskning!H$40))","v":""}]
[null,null,"Gemensamma kostnader (INDI)",49988,{"$f":"IF(Bidragsforskning!$D$33=\"\",\"Ange projektnummer\",Bidragsforskning!$D$33)","v":"Ange projektnummer"},{"$f":"IF(OR(Bidragsforskning!$D$30=\"\",Bidragsforskning!$E$30=\"\"),\"Ange start år/månad\",Bidragsforskning!$D$30&Bidragsforskning!$E$30)","v":"Ange start år/månad"},{"$f":"IF(OR(Bidragsforskning!$D$30=\"\",Bidragsforskning!$E$31=\"\"),\"Ange slut år/månad\",IF(_xlfn.NUMBERVALUE(Bidragsforskning!$D$30)=Bidragsforskning!$D$31,Bidragsforskning!$D$30&Bidragsforskning!$E$31,Bidragsforskning!$D$30&\"12\"))","v":"Ange slut år/månad"},{"$f":"Bidragsforskning!H$145","v":0},{"$f":"IF(OR(Bidragsforskning!$D$30=\"\",Bidragsforskning!$E$30=\"\"),\"\",IF(Bidragsforskning!$D$33=\"\",\"\",\"Budget \"&Bidragsforskning!$D$33&\" \"&Bidragsforskning!H$40))","v":""}]
[null,null,"Lokalkostnader",50111,{"$f":"IF(Bidragsforskning!$D$33=\"\",\"Ange projektnummer\",Bidragsforskning!$D$33)","v":"Ange projektnummer"},{"$f":"IF(OR(Bidragsforskning!$D$30=\"\",Bidragsforskning!$E$30=\"\"),\"Ange start år/månad\",Bidragsforskning!$D$30&Bidragsforskning!$E$30)","v":"Ange start år/månad"},{"$f":"IF(OR(Bidragsforskning!$D$30=\"\",Bidragsforskning!$E$31=\"\"),\"Ange slut år/månad\",IF(_xlfn.NUMBERVALUE(Bidragsforskning!$D$30)=Bidragsforskning!$D$31,Bidragsforskning!$D$30&Bidragsforskning!$E$31,Bidragsforskning!$D$30&\"12\"))","v":"Ange slut år/månad"},{"$f":"SUM(Bidragsforskning!I$125:I127)","v":0},{"$f":"IF(OR(Bidragsforskning!$D$30=\"\",Bidragsforskning!$E$30=\"\"),\"\",IF(Bidragsforskning!$D$33=\"\",\"\",\"Budget \"&Bidragsforskning!$D$33&\" \"&Bidragsforskning!H$40))","v":""}]
[null,null,"Resekostnader",5522,{"$f":"IF(Bidragsforskning!$D$33=\"\",\"Ange projektnummer\",Bidragsforskning!$D$33)","v":"Ange projektnummer"},{"$f":"IF(OR(Bidragsforskning!$D$30=\"\",Bidragsforskning!$E$30=\"\"),\"Ange start år/månad\",Bidragsforskning!$D$30&Bidragsforskning!$E$30)","v":"Ange start år/månad"},{"$f":"IF(OR(Bidragsforskning!$D$30=\"\",Bidragsforskning!$E$31=\"\"),\"Ange slut år/månad\",IF(_xlfn.NUMBERVALUE(Bidragsforskning!$D$30)=Bidragsforskning!$D$31,Bidragsforskning!$D$30&Bidragsforskning!$E$31,Bidragsforskning!$D$30&\"12\"))","v":"Ange slut år/månad"},{"$f":"Bidragsforskning!H98","v":0},{"$f":"IF(OR(Bidragsforskning!$D$30=\"\",Bidragsforskning!$E$30=\"\"),\"\",IF(Bidragsforskning!$D$33=\"\",\"\",\"Budget \"&Bidragsforskning!$D$33&\" \"&Bidragsforskning!H$40))","v":""}]
[null,null,"Övriga driftskostnader",5797,{"$f":"IF(Bidragsforskning!$D$33=\"\",\"Ange projektnummer\",Bidragsforskning!$D$33)","v":"Ange projektnummer"},{"$f":"IF(OR(Bidragsforskning!$D$30=\"\",Bidragsforskning!$E$30=\"\"),\"Ange start år/månad\",Bidragsforskning!$D$30&Bidragsforskning!$E$30)","v":"Ange start år/månad"},{"$f":"IF(OR(Bidragsforskning!$D$30=\"\",Bidragsforskning!$E$31=\"\"),\"Ange slut år/månad\",IF(_xlfn.NUMBERVALUE(Bidragsforskning!$D$30)=Bidragsforskning!$D$31,Bidragsforskning!$D$30&Bidragsforskning!$E$31,Bidragsforskning!$D$30&\"12\"))","v":"Ange slut år/månad"},{"$f":"Bidragsforskning!H114","v":0},{"$f":"IF(OR(Bidragsforskning!$D$30=\"\",Bidragsforskning!$E$30=\"\"),\"\",IF(Bidragsforskning!$D$33=\"\",\"\",\"Budget \"&Bidragsforskning!$D$33&\" \"&Bidragsforskning!H$40))","v":""}]
[null,null,"Interna kostnader",57849,{"$f":"IF(Bidragsforskning!$D$33=\"\",\"Ange projektnummer\",Bidragsforskning!$D$33)","v":"Ange projektnummer"},{"$f":"IF(OR(Bidragsforskning!$D$30=\"\",Bidragsforskning!$E$30=\"\"),\"Ange start år/månad\",Bidragsforskning!$D$30&Bidragsforskning!$E$30)","v":"Ange start år/månad"},{"$f":"IF(OR(Bidragsforskning!$D$30=\"\",Bidragsforskning!$E$31=\"\"),\"Ange slut år/månad\",IF(_xlfn.NUMBERVALUE(Bidragsforskning!$D$30)=Bidragsforskning!$D$31,Bidragsforskning!$D$30&Bidragsforskning!$E$31,Bidragsforskning!$D$30&\"12\"))","v":"Ange slut år/månad"},{"$f":"SUM(Bidragsforskning!I$131:I133)","v":0},{"$f":"IF(OR(Bidragsforskning!$D$30=\"\",Bidragsforskning!$E$30=\"\"),\"\",IF(Bidragsforskning!$D$33=\"\",\"\",\"Budget \"&Bidragsforskning!$D$33&\" \"&Bidragsforskning!H$40))","v":""}]
[null,null,"Avskrivningar",6911,{"$f":"IF(Bidragsforskning!$D$33=\"\",\"Ange projektnummer\",Bidragsforskning!$D$33)","v":"Ange projektnummer"},{"$f":"IF(OR(Bidragsforskning!$D$30=\"\",Bidragsforskning!$E$30=\"\"),\"Ange start år/månad\",Bidragsforskning!$D$30&Bidragsforskning!$E$30)","v":"Ange start år/månad"},{"$f":"IF(OR(Bidragsforskning!$D$30=\"\",Bidragsforskning!$E$31=\"\"),\"Ange slut år/månad\",IF(_xlfn.NUMBERVALUE(Bidragsforskning!$D$30)=Bidragsforskning!$D$31,Bidragsforskning!$D$30&Bidragsforskning!$E$31,Bidragsforskning!$D$30&\"12\"))","v":"Ange slut år/månad"},{"$f":"SUM(Bidragsforskning!I$120:I121)","v":0},{"$f":"IF(OR(Bidragsforskning!$D$30=\"\",Bidragsforskning!$E$30=\"\"),\"\",IF(Bidragsforskning!$D$33=\"\",\"\",\"Budget \"&Bidragsforskning!$D$33&\" \"&Bidragsforskning!H$40))","v":""}]
[null,null,"Intäkter av bidrag",3511,{"$f":"IF(Bidragsforskning!$D$33=\"\",\"Ange projektnummer\",Bidragsforskning!$D$33)","v":"Ange projektnummer"},{"$f":"RIGHT(I35,4)&\"01\"","v":"01"},{"$f":"IF(_xlfn.NUMBERVALUE(RIGHT(I35,4))=Bidragsforskning!$D$31,RIGHT(I35,4)&Bidragsforskning!$E$31,RIGHT(I35,4)&\"12\")","v":""},{"$f":"Bidragsforskning!J$159*-1","v":0},{"$f":"IF(OR(Bidragsforskning!$D$30=\"\",Bidragsforskning!$E$30=\"\"),\"\",IF(Bidragsforskning!$D$33=\"\",\"\",\"Budget \"&Bidragsforskning!$D$33&\" \"&Bidragsforskning!H$40+1))","v":""}]
[null,null,"Personalkostnader",4011,{"$f":"IF(Bidragsforskning!$D$33=\"\",\"Ange projektnummer\",Bidragsforskning!$D$33)","v":"Ange projektnummer"},"01",{"$f":"IF(_xlfn.NUMBERVALUE(RIGHT(I36,4))=Bidragsforskning!$D$31,RIGHT(I36,4)&Bidragsforskning!$E$31,RIGHT(I36,4)&\"12\")","v":""},{"$f":"Bidragsforskning!J$86","v":0},{"$f":"IF(OR(Bidragsforskning!$D$30=\"\",Bidragsforskning!$E$30=\"\"),\"\",IF(Bidragsforskning!$D$33=\"\",\"\",\"Budget \"&Bidragsforskning!$D$33&\" \"&Bidragsforskning!H$40+1))","v":""}]
[null,null,"Gemensamma kostnader (INDI)",49988,{"$f":"IF(Bidragsforskning!$D$33=\"\",\"Ange projektnummer\",Bidragsforskning!$D$33)","v":"Ange projektnummer"},"01",{"$f":"IF(_xlfn.NUMBERVALUE(RIGHT(I37,4))=Bidragsforskning!$D$31,RIGHT(I37,4)&Bidragsforskning!$E$31,RIGHT(I37,4)&\"12\")","v":""},{"$f":"Bidragsforskning!J$145","v":0},{"$f":"IF(OR(Bidragsforskning!$D$30=\"\",Bidragsforskning!$E$30=\"\"),\"\",IF(Bidragsforskning!$D$33=\"\",\"\",\"Budget \"&Bidragsforskning!$D$33&\" \"&Bidragsforskning!H$40+1))","v":""}]
[null,null,"Lokalkostnader",50111,{"$f":"IF(Bidragsforskning!$D$33=\"\",\"Ange projektnummer\",Bidragsforskning!$D$33)","v":"Ange projektnummer"},"01",{"$f":"IF(_xlfn.NUMBERVALUE(RIGHT(I38,4))=Bidragsforskning!$D$31,RIGHT(I38,4)&Bidragsforskning!$E$31,RIGHT(I38,4)&\"12\")","v":""},{"$f":"SUM(Bidragsforskning!K$125:K127)","v":0},{"$f":"IF(OR(Bidragsforskning!$D$30=\"\",Bidragsforskning!$E$30=\"\"),\"\",IF(Bidragsforskning!$D$33=\"\",\"\",\"Budget \"&Bidragsforskning!$D$33&\" \"&Bidragsforskning!H$40+1))","v":""}]
[null,null,"Resekostnader",5522,{"$f":"IF(Bidragsforskning!$D$33=\"\",\"Ange projektnummer\",Bidragsforskning!$D$33)","v":"Ange projektnummer"},"01",{"$f":"IF(_xlfn.NUMBERVALUE(RIGHT(I39,4))=Bidragsforskning!$D$31,RIGHT(I39,4)&Bidragsforskning!$E$31,RIGHT(I39,4)&\"12\")","v":""},{"$f":"Bidragsforskning!J98","v":0},{"$f":"IF(OR(Bidragsforskning!$D$30=\"\",Bidragsforskning!$E$30=\"\"),\"\",IF(Bidragsforskning!$D$33=\"\",\"\",\"Budget \"&Bidragsforskning!$D$33&\" \"&Bidragsforskning!H$40+1))","v":""}]
[null,null,"Övriga driftskostnader",5797,{"$f":"IF(Bidragsforskning!$D$33=\"\",\"Ange projektnummer\",Bidragsforskning!$D$33)","v":"Ange projektnummer"},"01",{"$f":"IF(_xlfn.NUMBERVALUE(RIGHT(I40,4))=Bidragsforskning!$D$31,RIGHT(I40,4)&Bidragsforskning!$E$31,RIGHT(I40,4)&\"12\")","v":""},{"$f":"Bidragsforskning!J114","v":0},{"$f":"IF(OR(Bidragsforskning!$D$30=\"\",Bidragsforskning!$E$30=\"\"),\"\",IF(Bidragsforskning!$D$33=\"\",\"\",\"Budget \"&Bidragsforskning!$D$33&\" \"&Bidragsforskning!H$40+1))","v":""}]
[null,null,"Interna kostnader",57849,{"$f":"IF(Bidragsforskning!$D$33=\"\",\"Ange projektnummer\",Bidragsforskning!$D$33)","v":"Ange projektnummer"},"01",{"$f":"IF(_xlfn.NUMBERVALUE(RIGHT(I41,4))=Bidragsforskning!$D$31,RIGHT(I41,4)&Bidragsforskning!$E$31,RIGHT(I41,4)&\"12\")","v":""},{"$f":"SUM(Bidragsforskning!K$131:K133)","v":0},{"$f":"IF(OR(Bidragsforskning!$D$30=\"\",Bidragsforskning!$E$30=\"\"),\"\",IF(Bidragsforskning!$D$33=\"\",\"\",\"Budget \"&Bidragsforskning!$D$33&\" \"&Bidragsforskning!H$40+1))","v":""}]
[null,null,"Avskrivningar",6911,{"$f":"IF(Bidragsforskning!$D$33=\"\",\"Ange projektnummer\",Bidragsforskning!$D$33)","v":"Ange projektnummer"},"01",{"$f":"IF(_xlfn.NUMBERVALUE(RIGHT(I42,4))=Bidragsforskning!$D$31,RIGHT(I42,4)&Bidragsforskning!$E$31,RIGHT(I42,4)&\"12\")","v":""},{"$f":"SUM(Bidragsforskning!K$120:K121)","v":0},{"$f":"IF(OR(Bidragsforskning!$D$30=\"\",Bidragsforskning!$E$30=\"\"),\"\",IF(Bidragsforskning!$D$33=\"\",\"\",\"Budget \"&Bidragsforskning!$D$33&\" \"&Bidragsforskning!H$40+1))","v":""}]
[null,null,"Intäkter av bidrag",3511,{"$f":"IF(Bidragsforskning!$D$33=\"\",\"Ange projektnummer\",Bidragsforskning!$D$33)","v":"Ange projektnummer"},"01",{"$f":"IF(_xlfn.NUMBERVALUE(RIGHT(I43,4))=Bidragsforskning!$D$31,RIGHT(I43,4)&Bidragsforskning!$E$31,RIGHT(I43,4)&\"12\")","v":""},{"$f":"Bidragsforskning!L$159*-1","v":0},{"$f":"IF(OR(Bidragsforskning!$D$30=\"\",Bidragsforskning!$E$30=\"\"),\"\",IF(Bidragsforskning!$D$33=\"\",\"\",\"Budget \"&Bidragsforskning!$D$33&\" \"&Bidragsforskning!H$40+2))","v":""}]
[null,null,"Personalkostnader",4011,{"$f":"IF(Bidragsforskning!$D$33=\"\",\"Ange projektnummer\",Bidragsforskning!$D$33)","v":"Ange projektnummer"},"01",{"$f":"IF(_xlfn.NUMBERVALUE(RIGHT(I44,4))=Bidragsforskning!$D$31,RIGHT(I44,4)&Bidragsforskning!$E$31,RIGHT(I44,4)&\"12\")","v":""},{"$f":"Bidragsforskning!L$86","v":0},{"$f":"IF(OR(Bidragsforskning!$D$30=\"\",Bidragsforskning!$E$30=\"\"),\"\",IF(Bidragsforskning!$D$33=\"\",\"\",\"Budget \"&Bidragsforskning!$D$33&\" \"&Bidragsforskning!H$40+2))","v":""}]
[null,null,"Gemensamma kostnader (INDI)",49988,{"$f":"IF(Bidragsforskning!$D$33=\"\",\"Ange projektnummer\",Bidragsforskning!$D$33)","v":"Ange projektnummer"},"01",{"$f":"IF(_xlfn.NUMBERVALUE(RIGHT(I45,4))=Bidragsforskning!$D$31,RIGHT(I45,4)&Bidragsforskning!$E$31,RIGHT(I45,4)&\"12\")","v":""},{"$f":"Bidragsforskning!L$145","v":0},{"$f":"IF(OR(Bidragsforskning!$D$30=\"\",Bidragsforskning!$E$30=\"\"),\"\",IF(Bidragsforskning!$D$33=\"\",\"\",\"Budget \"&Bidragsforskning!$D$33&\" \"&Bidragsforskning!H$40+2))","v":""}]
[null,null,"Lokalkostnader",50111,{"$f":"IF(Bidragsforskning!$D$33=\"\",\"Ange projektnummer\",Bidragsforskning!$D$33)","v":"Ange projektnummer"},"01",{"$f":"IF(_xlfn.NUMBERVALUE(RIGHT(I46,4))=Bidragsforskning!$D$31,RIGHT(I46,4)&Bidragsforskning!$E$31,RIGHT(I46,4)&\"12\")","v":""},{"$f":"SUM(Bidragsforskning!M$125:M127)","v":0},{"$f":"IF(OR(Bidragsforskning!$D$30=\"\",Bidragsforskning!$E$30=\"\"),\"\",IF(Bidragsforskning!$D$33=\"\",\"\",\"Budget \"&Bidragsforskning!$D$33&\" \"&Bidragsforskning!H$40+2))","v":""}]
[null,null,"Resekostnader",5522,{"$f":"IF(Bidragsforskning!$D$33=\"\",\"Ange projektnummer\",Bidragsforskning!$D$33)","v":"Ange projektnummer"},"01",{"$f":"IF(_xlfn.NUMBERVALUE(RIGHT(I47,4))=Bidragsforskning!$D$31,RIGHT(I47,4)&Bidragsforskning!$E$31,RIGHT(I47,4)&\"12\")","v":""},{"$f":"Bidragsforskning!L98","v":0},{"$f":"IF(OR(Bidragsforskning!$D$30=\"\",Bidragsforskning!$E$30=\"\"),\"\",IF(Bidragsforskning!$D$33=\"\",\"\",\"Budget \"&Bidragsforskning!$D$33&\" \"&Bidragsforskning!H$40+2))","v":""}]
[null,null,"Övriga driftskostnader",5797,{"$f":"IF(Bidragsforskning!$D$33=\"\",\"Ange projektnummer\",Bidragsforskning!$D$33)","v":"Ange projektnummer"},"01",{"$f":"IF(_xlfn.NUMBERVALUE(RIGHT(I48,4))=Bidragsforskning!$D$31,RIGHT(I48,4)&Bidragsforskning!$E$31,RIGHT(I48,4)&\"12\")","v":""},{"$f":"Bidragsforskning!L114","v":0},{"$f":"IF(OR(Bidragsforskning!$D$30=\"\",Bidragsforskning!$E$30=\"\"),\"\",IF(Bidragsforskning!$D$33=\"\",\"\",\"Budget \"&Bidragsforskning!$D$33&\" \"&Bidragsforskning!H$40+2))","v":""}]
[null,null,"Interna kostnader",57849,{"$f":"IF(Bidragsforskning!$D$33=\"\",\"Ange projektnummer\",Bidragsforskning!$D$33)","v":"Ange projektnummer"},"01",{"$f":"IF(_xlfn.NUMBERVALUE(RIGHT(I49,4))=Bidragsforskning!$D$31,RIGHT(I49,4)&Bidragsforskning!$E$31,RIGHT(I49,4)&\"12\")","v":""},{"$f":"SUM(Bidragsforskning!M$131:M133)","v":0},{"$f":"IF(OR(Bidragsforskning!$D$30=\"\",Bidragsforskning!$E$30=\"\"),\"\",IF(Bidragsforskning!$D$33=\"\",\"\",\"Budget \"&Bidragsforskning!$D$33&\" \"&Bidragsforskning!H$40+2))","v":""}]
[null,null,"Avskrivningar",6911,{"$f":"IF(Bidragsforskning!$D$33=\"\",\"Ange projektnummer\",Bidragsforskning!$D$33)","v":"Ange projektnummer"},"01",{"$f":"IF(_xlfn.NUMBERVALUE(RIGHT(I50,4))=Bidragsforskning!$D$31,RIGHT(I50,4)&Bidragsforskning!$E$31,RIGHT(I50,4)&\"12\")","v":""},{"$f":"SUM(Bidragsforskning!M$120:M121)","v":0},{"$f":"IF(OR(Bidragsforskning!$D$30=\"\",Bidragsforskning!$E$30=\"\"),\"\",IF(Bidragsforskning!$D$33=\"\",\"\",\"Budget \"&Bidragsforskning!$D$33&\" \"&Bidragsforskning!H$40+2))","v":""}]
[null,null,"Intäkter av bidrag",3511,{"$f":"IF(Bidragsforskning!$D$33=\"\",\"Ange projektnummer\",Bidragsforskning!$D$33)","v":"Ange projektnummer"},"01",{"$f":"IF(_xlfn.NUMBERVALUE(RIGHT(I51,4))=Bidragsforskning!$D$31,RIGHT(I51,4)&Bidragsforskning!$E$31,RIGHT(I51,4)&\"12\")","v":""},{"$f":"Bidragsforskning!N$159*-1","v":0},{"$f":"IF(OR(Bidragsforskning!$D$30=\"\",Bidragsforskning!$E$30=\"\"),\"\",IF(Bidragsforskning!$D$33=\"\",\"\",\"Budget \"&Bidragsforskning!$D$33&\" \"&Bidragsforskning!H$40+3))","v":""}]
[null,null,"Personalkostnader",4011,{"$f":"IF(Bidragsforskning!$D$33=\"\",\"Ange projektnummer\",Bidragsforskning!$D$33)","v":"Ange projektnummer"},"01",{"$f":"IF(_xlfn.NUMBERVALUE(RIGHT(I52,4))=Bidragsforskning!$D$31,RIGHT(I52,4)&Bidragsforskning!$E$31,RIGHT(I52,4)&\"12\")","v":""},{"$f":"Bidragsforskning!N$86","v":0},{"$f":"IF(OR(Bidragsforskning!$D$30=\"\",Bidragsforskning!$E$30=\"\"),\"\",IF(Bidragsforskning!$D$33=\"\",\"\",\"Budget \"&Bidragsforskning!$D$33&\" \"&Bidragsforskning!H$40+3))","v":""}]
[null,null,"Gemensamma kostnader (INDI)",49988,{"$f":"IF(Bidragsforskning!$D$33=\"\",\"Ange projektnummer\",Bidragsforskning!$D$33)","v":"Ange projektnummer"},"01",{"$f":"IF(_xlfn.NUMBERVALUE(RIGHT(I53,4))=Bidragsforskning!$D$31,RIGHT(I53,4)&Bidragsforskning!$E$31,RIGHT(I53,4)&\"12\")","v":""},{"$f":"Bidragsforskning!N$145","v":0},{"$f":"IF(OR(Bidragsforskning!$D$30=\"\",Bidragsforskning!$E$30=\"\"),\"\",IF(Bidragsforskning!$D$33=\"\",\"\",\"Budget \"&Bidragsforskning!$D$33&\" \"&Bidragsforskning!H$40+3))","v":""}]
[null,null,"Lokalkostnader",50111,{"$f":"IF(Bidragsforskning!$D$33=\"\",\"Ange projektnummer\",Bidragsforskning!$D$33)","v":"Ange projektnummer"},"01",{"$f":"IF(_xlfn.NUMBERVALUE(RIGHT(I54,4))=Bidragsforskning!$D$31,RIGHT(I54,4)&Bidragsforskning!$E$31,RIGHT(I54,4)&\"12\")","v":""},{"$f":"SUM(Bidragsforskning!O$125:O127)","v":0},{"$f":"IF(OR(Bidragsforskning!$D$30=\"\",Bidragsforskning!$E$30=\"\"),\"\",IF(Bidragsforskning!$D$33=\"\",\"\",\"Budget \"&Bidragsforskning!$D$33&\" \"&Bidragsforskning!H$40+3))","v":""}]
[null,null,"Resekostnader",5522,{"$f":"IF(Bidragsforskning!$D$33=\"\",\"Ange projektnummer\",Bidragsforskning!$D$33)","v":"Ange projektnummer"},"01",{"$f":"IF(_xlfn.NUMBERVALUE(RIGHT(I55,4))=Bidragsforskning!$D$31,RIGHT(I55,4)&Bidragsforskning!$E$31,RIGHT(I55,4)&\"12\")","v":""},{"$f":"Bidragsforskning!N98","v":0},{"$f":"IF(OR(Bidragsforskning!$D$30=\"\",Bidragsforskning!$E$30=\"\"),\"\",IF(Bidragsforskning!$D$33=\"\",\"\",\"Budget \"&Bidragsforskning!$D$33&\" \"&Bidragsforskning!H$40+3))","v":""}]
[null,null,"Övriga driftskostnader",5797,{"$f":"IF(Bidragsforskning!$D$33=\"\",\"Ange projektnummer\",Bidragsforskning!$D$33)","v":"Ange projektnummer"},"01",{"$f":"IF(_xlfn.NUMBERVALUE(RIGHT(I56,4))=Bidragsforskning!$D$31,RIGHT(I56,4)&Bidragsforskning!$E$31,RIGHT(I56,4)&\"12\")","v":""},{"$f":"Bidragsforskning!N114","v":0},{"$f":"IF(OR(Bidragsforskning!$D$30=\"\",Bidragsforskning!$E$30=\"\"),\"\",IF(Bidragsforskning!$D$33=\"\",\"\",\"Budget \"&Bidragsforskning!$D$33&\" \"&Bidragsforskning!H$40+3))","v":""}]
[null,null,"Interna kostnader",57849,{"$f":"IF(Bidragsforskning!$D$33=\"\",\"Ange projektnummer\",Bidragsforskning!$D$33)","v":"Ange projektnummer"},"01",{"$f":"IF(_xlfn.NUMBERVALUE(RIGHT(I57,4))=Bidragsforskning!$D$31,RIGHT(I57,4)&Bidragsforskning!$E$31,RIGHT(I57,4)&\"12\")","v":""},{"$f":"SUM(Bidragsforskning!O$131:O133)","v":0},{"$f":"IF(OR(Bidragsforskning!$D$30=\"\",Bidragsforskning!$E$30=\"\"),\"\",IF(Bidragsforskning!$D$33=\"\",\"\",\"Budget \"&Bidragsforskning!$D$33&\" \"&Bidragsforskning!H$40+3))","v":""}]
[null,null,"Avskrivningar",6911,{"$f":"IF(Bidragsforskning!$D$33=\"\",\"Ange projektnummer\",Bidragsforskning!$D$33)","v":"Ange projektnummer"},"01",{"$f":"IF(_xlfn.NUMBERVALUE(RIGHT(I58,4))=Bidragsforskning!$D$31,RIGHT(I58,4)&Bidragsforskning!$E$31,RIGHT(I58,4)&\"12\")","v":""},{"$f":"SUM(Bidragsforskning!O$120:O121)","v":0},{"$f":"IF(OR(Bidragsforskning!$D$30=\"\",Bidragsforskning!$E$30=\"\"),\"\",IF(Bidragsforskning!$D$33=\"\",\"\",\"Budget \"&Bidragsforskning!$D$33&\" \"&Bidragsforskning!H$40+3))","v":""}]
[null,null,"Intäkter av bidrag",3511,{"$f":"IF(Bidragsforskning!$D$33=\"\",\"Ange projektnummer\",Bidragsforskning!$D$33)","v":"Ange projektnummer"},"01",{"$f":"IF(_xlfn.NUMBERVALUE(RIGHT(I59,4))=Bidragsforskning!$D$31,RIGHT(I59,4)&Bidragsforskning!$E$31,RIGHT(I59,4)&\"12\")","v":""},{"$f":"Bidragsforskning!P$159*-1","v":0},{"$f":"IF(OR(Bidragsforskning!$D$30=\"\",Bidragsforskning!$E$30=\"\"),\"\",IF(Bidragsforskning!$D$33=\"\",\"\",\"Budget \"&Bidragsforskning!$D$33&\" \"&Bidragsforskning!H$40+4))","v":""}]
[null,null,"Personalkostnader",4011,{"$f":"IF(Bidragsforskning!$D$33=\"\",\"Ange projektnummer\",Bidragsforskning!$D$33)","v":"Ange projektnummer"},"01",{"$f":"IF(_xlfn.NUMBERVALUE(RIGHT(I60,4))=Bidragsforskning!$D$31,RIGHT(I60,4)&Bidragsforskning!$E$31,RIGHT(I60,4)&\"12\")","v":""},{"$f":"Bidragsforskning!P$86","v":0},{"$f":"IF(OR(Bidragsforskning!$D$30=\"\",Bidragsforskning!$E$30=\"\"),\"\",IF(Bidragsforskning!$D$33=\"\",\"\",\"Budget \"&Bidragsforskning!$D$33&\" \"&Bidragsforskning!H$40+4))","v":""}]
[null,null,"Gemensamma kostnader (INDI)",49988,{"$f":"IF(Bidragsforskning!$D$33=\"\",\"Ange projektnummer\",Bidragsforskning!$D$33)","v":"Ange projektnummer"},"01",{"$f":"IF(_xlfn.NUMBERVALUE(RIGHT(I61,4))=Bidragsforskning!$D$31,RIGHT(I61,4)&Bidragsforskning!$E$31,RIGHT(I61,4)&\"12\")","v":""},{"$f":"Bidragsforskning!P$145","v":0},{"$f":"IF(OR(Bidragsforskning!$D$30=\"\",Bidragsforskning!$E$30=\"\"),\"\",IF(Bidragsforskning!$D$33=\"\",\"\",\"Budget \"&Bidragsforskning!$D$33&\" \"&Bidragsforskning!H$40+4))","v":""}]
[null,null,"Lokalkostnader",50111,{"$f":"IF(Bidragsforskning!$D$33=\"\",\"Ange projektnummer\",Bidragsforskning!$D$33)","v":"Ange projektnummer"},"01",{"$f":"IF(_xlfn.NUMBERVALUE(RIGHT(I62,4))=Bidragsforskning!$D$31,RIGHT(I62,4)&Bidragsforskning!$E$31,RIGHT(I62,4)&\"12\")","v":""},{"$f":"SUM(Bidragsforskning!Q$125:Q127)","v":0},{"$f":"IF(OR(Bidragsforskning!$D$30=\"\",Bidragsforskning!$E$30=\"\"),\"\",IF(Bidragsforskning!$D$33=\"\",\"\",\"Budget \"&Bidragsforskning!$D$33&\" \"&Bidragsforskning!H$40+4))","v":""}]
[null,null,"Resekostnader",5522,{"$f":"IF(Bidragsforskning!$D$33=\"\",\"Ange projektnummer\",Bidragsforskning!$D$33)","v":"Ange projektnummer"},"01",{"$f":"IF(_xlfn.NUMBERVALUE(RIGHT(I63,4))=Bidragsforskning!$D$31,RIGHT(I63,4)&Bidragsforskning!$E$31,RIGHT(I63,4)&\"12\")","v":""},{"$f":"Bidragsforskning!P98","v":0},{"$f":"IF(OR(Bidragsforskning!$D$30=\"\",Bidragsforskning!$E$30=\"\"),\"\",IF(Bidragsforskning!$D$33=\"\",\"\",\"Budget \"&Bidragsforskning!$D$33&\" \"&Bidragsforskning!H$40+4))","v":""}]
[null,null,"Övriga driftskostnader",5797,{"$f":"IF(Bidragsforskning!$D$33=\"\",\"Ange projektnummer\",Bidragsforskning!$D$33)","v":"Ange projektnummer"},"01",{"$f":"IF(_xlfn.NUMBERVALUE(RIGHT(I64,4))=Bidragsforskning!$D$31,RIGHT(I64,4)&Bidragsforskning!$E$31,RIGHT(I64,4)&\"12\")","v":""},{"$f":"Bidragsforskning!P114","v":0},{"$f":"IF(OR(Bidragsforskning!$D$30=\"\",Bidragsforskning!$E$30=\"\"),\"\",IF(Bidragsforskning!$D$33=\"\",\"\",\"Budget \"&Bidragsforskning!$D$33&\" \"&Bidragsforskning!H$40+4))","v":""}]
[null,null,"Interna kostnader",57849,{"$f":"IF(Bidragsforskning!$D$33=\"\",\"Ange projektnummer\",Bidragsforskning!$D$33)","v":"Ange projektnummer"},"01",{"$f":"IF(_xlfn.NUMBERVALUE(RIGHT(I65,4))=Bidragsforskning!$D$31,RIGHT(I65,4)&Bidragsforskning!$E$31,RIGHT(I65,4)&\"12\")","v":""},{"$f":"SUM(Bidragsforskning!Q$131:Q133)","v":0},{"$f":"IF(OR(Bidragsforskning!$D$30=\"\",Bidragsforskning!$E$30=\"\"),\"\",IF(Bidragsforskning!$D$33=\"\",\"\",\"Budget \"&Bidragsforskning!$D$33&\" \"&Bidragsforskning!H$40+4))","v":""}]
[null,null,"Avskrivningar",6911,{"$f":"IF(Bidragsforskning!$D$33=\"\",\"Ange projektnummer\",Bidragsforskning!$D$33)","v":"Ange projektnummer"},"01",{"$f":"IF(_xlfn.NUMBERVALUE(RIGHT(I66,4))=Bidragsforskning!$D$31,RIGHT(I66,4)&Bidragsforskning!$E$31,RIGHT(I66,4)&\"12\")","v":""},{"$f":"SUM(Bidragsforskning!Q$120:Q121)","v":0},{"$f":"IF(OR(Bidragsforskning!$D$30=\"\",Bidragsforskning!$E$30=\"\"),\"\",IF(Bidragsforskning!$D$33=\"\",\"\",\"Budget \"&Bidragsforskning!$D$33&\" \"&Bidragsforskning!H$40+4))","v":""}]

{"sheet":"INDI FO 2025","index":9,"n_rows":1376,"n_cols":21,"rows_kept":1376,"cut":false,"hidden":true,"merged":[[0,0,0,6]]}
["Forskning/Forskarutbildning 2025",null,null,null,null,null,null,null,null,null,"Obs kostnadsunderlag är hämtad från INDI budgeten"]
["Inst","Namn",{"$f":"A2&\" - \"&B2","v":"Inst - Namn"},"Institution","Fakultet","Universitet","Summa",null,null,null,null,null,"Kostnadsunderlag (summa kostnadsunderlag FO)","Universitetsgemensam","Univgem andel av total","Insitutionsgemensam","Summa","Andel av total","Uni"]
["C1","MTC",{"$f":"A3&\" - \"&B3","v":"C1 - MTC"},0.08,null,0.14499999999999999,{"$f":"SUM(D3:F3)","v":0.22499999999999998},null,null,null,"C1","MTC",220800,{"$f":"M3*F3","v":32015.999999999996},{"$f":"N3/$N$27","v":5.3682220313590746E-2},{"$f":"D3*M3","v":17664},{"$f":"SUM(N3:O3)","v":32016.05368222031},{"$f":"Q3/$S$27","v":5.3682310324234733E-2},{"$f":"M3*T3","v":32015.999999999996},{"$f":"N3/M3","v":0.14499999999999999}]
["C2","MBB","C2 - MBB",5.9400000000000001E-2,null,0.14499999999999999,0.2044,null,null,null,"C2","MBB",290000,{"$f":"M4*F4","v":42050},7.0506539361147272E-2,17226,42050.070506539363,{"$f":"Q4/$S$27","v":7.0506657581648896E-2},{"$f":"M4*T4","v":42050},0.14499999999999999]
["C3","FyFa","C3 - FyFa",0.08,null,0.14499999999999999,0.22499999999999998,null,null,null,"C3","FyFa",144500,{"$f":"M5*F5","v":20952.5},3.5131706681675111E-2,11560,20952.535131706682,3.5131765588097462E-2,20952.5,0.14499999999999999]
["C4","Neuro","C4 - Neuro",7.4999999999999997E-2,null,0.14499999999999999,0.21999999999999997,null,null,null,"C4","Neuro",151400,21953,3.6809276066474821E-2,11355,21953.036809276065,3.6809337785729798E-2,21953,0.14499999999999999]
["C5","CMB","C5 - CMB",7.0000000000000007E-2,null,0.14499999999999999,0.215,null,null,null,"C5","CMB",172200,24969,4.186629682065366E-2,12054.000000000002,24969.041866296822,4.1866367019172207E-2,24969,0.14499999999999999]
["C6","IMM","C6 - IMM",7.5999999999999998E-2,null,0.14499999999999999,0.22099999999999997,null,null,null,"C6","IMM",191000,27694.999999999996,4.6437065579238372E-2,14516,27695.046437065575,4.6437143441706678E-2,27694.999999999996,0.14499999999999999]
["C7","LIME","C7 - LIME",0.13500000000000001,null,0.14499999999999999,0.28000000000000003,null,null,null,"C7","LIME",51100,7409.4999999999991,1.2423738487429743E-2,6898.5,7409.5124237384862,1.2423759318697439E-2,7409.4999999999991,0.14499999999999999]
["C8","MEB","C8 - MEB",0.11700000000000001,null,0.14499999999999999,0.26200000000000001,null,null,null,"C8","MEB",219800,31870.999999999996,5.3439094315793689E-2,25716.600000000002,31871.053439094314,5.3439183918780775E-2,31870.999999999996,0.14499999999999999]
["CC","KM","CC - KM",9.5000000000000001E-2,null,0.14499999999999999,0.24,null,null,null,"CC","KM",91610,13283.449999999999,2.2272772658188625E-2,8702.9500000000007,13283.472272772657,2.2272810003637428E-2,13283.449999999999,0.14499999999999999]
["D1","KIDS","D1 - KIDS",0.09,null,0.14499999999999999,0.23499999999999999,null,null,null,"D1","KIDS",41567.304610000007,6027.2591684500003,1.0106092409040566E-2,3741.0574149000004,6027.2692745424092,1.010610935423919E-2,6027.2591684500003,0.14499999999999999]
["H1","NVS","H1 - NVS",9.5000000000000001E-2,null,0.14499999999999999,0.24,null,null,null,"H1","NVS",234100,33944.5,5.6915796084291648E-2,22239.5,33944.556915796085,5.6915891516772434E-2,33944.5,0.14499999999999999]
["H5","LABMED","H5 - LABMED",7.2800000000000004E-2,null,0.14499999999999999,0.21779999999999999,null,null,null,"H5","LABMED",143044,20741.379999999997,3.4777715228882587E-2,10413.603200000001,20741.414777715225,3.4777773541756485E-2,20741.379999999997,0.14499999999999999]
["H7","MedH","H7 - MedH",7.1900000000000006E-2,null,0.14499999999999999,0.21689999999999998,null,null,null,"H7","MedH",488280,70800.599999999991,0.11871356220434824,35107.332000000002,70800.718713562193,0.11871376125506039,70800.599999999991,0.14499999999999999]
["H9","CLINTEC","H9 - CLINTEC",7.3999999999999996E-2,null,0.14499999999999999,0.21899999999999997,null,null,null,"H9","CLINTEC",120500,17472.5,2.9296682734545679E-2,8917,17472.529296682733,2.9296731857202381E-2,17472.5,0.14499999999999999]
["K1","MMK","K1 - MMK",0.09,null,0.14499999999999999,0.23499999999999999,null,null,null,"K1","MMK",184300,26723.499999999996,4.4808121393998077E-2,16587,26723.544808121391,4.4808196525165135E-2,26723.499999999996,0.14499999999999999]
["K2","MedS","K2 - MedS",9.7000000000000003E-2,null,0.14499999999999999,0.24199999999999999,null,null,null,"K2","MedS",358400,51968,8.7136357610466147E-2,34764.800000000003,51968.087136357608,8.7136503714699859E-2,51968,0.14499999999999999]
["K6","KBH","K6 - KBH",7.4999999999999997E-2,null,0.14499999999999999,0.21999999999999997,null,null,null,"K6","KBH",196400,28477.999999999996,4.7749945967342493E-2,14730,28478.047749945963,4.775002603115807E-2,28477.999999999996,0.14499999999999999]
["K7","OnkPat","K7 - OnkPat",7.0000000000000007E-2,null,0.14499999999999999,0.215,null,null,null,"K7","OnkPat",267188.80677000002,38742.376981649999,6.4960545246162002E-2,18703.216473900004,38742.441942195248,6.4960654167523252E-2,38742.376981649999,0.14499999999999999]
["K8","CNS","K8 - CNS",7.0000000000000007E-2,null,0.14499999999999999,0.215,null,null,null,"K8","CNS",340000,49300,8.2662839251000264E-2,23800.000000000004,49300.082662839253,8.2662977854346981E-2,49300,0.14499999999999999]
["K9","GPH","K9 - GPH",0.109,null,0.14499999999999999,0.254,null,null,null,"K9","GPH",103200,14963.999999999998,2.5090602972656546E-2,11248.8,14964.025090602971,2.5090645042848841E-2,14963.999999999998,0.14499999999999999]
["OF","DENTMED","OF - DENTMED",0.14899999999999999,null,0.14499999999999999,0.29399999999999998,null,null,null,"OF","DENTMED",31566,4577.07,7.6745152464619826E-3,4703.3339999999998,4577.0776745152461,7.6745281145597539E-3,4577.07,0.14499999999999999]
["OV","Universitetstandvården","OV - Universitetstandvården",0.1555,null,5.62E-2,0.2117,null,null,null,"OV","Universitetstandvården",34607.908864366902,{"$f":"M24*F24","v":1944.9644781774198},3.2611822719773964E-3,5381.5298284090532,1944.9677393596917,{"$f":"Q24/$S$27","v":3.2611877401028714E-3},1944.9644781774198,5.62E-2,"egen procent på OV"]
["S1","SÖS","S1 - SÖS",0.105,null,0.14499999999999999,0.25,null,null,null,"S1","SÖS",49672,7202.44,1.2076554562575543E-2,5215.5599999999995,7202.4520765545622,1.2076574811709184E-2,7202.44,0.14499999999999999]
["TL","Undervisning och lärande","TL - Undervisning och lärande",7.4999999999999997E-2,null,0.14499999999999999,0.21999999999999997,null,null,null,"TL","Undervisning och lärande",9052,1312.54,2.2007765320589835E-3,678.9,1312.5422007765321,2.2007802221692611E-3,1312.54,0.14499999999999999]
["UF","Externt","UF - Externt",null,null,null,0.39,null,null,null,null,null,{"$f":"SUM(M3:M26)","v":4134288.020244367},{"$f":"SUM(N3:N26)","v":596398.58062827727},null,null,null,null,{"$f":"SUM(N27:P27)","v":596398.58062827727}]
["UF","Internt","UF - Internt",null,null,null,0.16]
[]
[]
[]
[]
[]
["All INDI budget - UF saknas",null,null,null,null,null,null,null,null,null,null,"Arbetsgivaransvar",null,null,null,"Beräkning för att få fördelningen på respektive nivå för inst"]
[null,null,null,null,null,null,null,null,null,null,null,"Hämtad från slutliga INDI budget",null,null,null,"Forskningsrelaterade projekt","Grp1","HuvudGrp","HuvudGrpEng"]
["Konto","Inst","Proj","Fin","Anl","Mpt","Verks","Text","Per","Budget (DC)",null,"Inst","Arbetsgivaransvar i KSEK","Arbetsgivaransvar i SEK",null,81008002,"Ledning","Ledning","Management",{"$f":"SUMIFS($J$37:$J$1375,$A$37:$A$1375,\"39498\",$C$37:$C$1375,LEFT(Bidragsforskning!$D$28,2)&'INDI FO 2025'!$P36)+SUMIF($L$37:$L$61,LEFT(Bidragsforskning!$D$28,2),'INDI FO 2025'!$N$37:$N$61)","v":0},"Egen kalkylering på denna rad med arbetsgivaransvar"]
[40,"C1","C181008001",null,null,null,null,null,null,157424.68499999997,null,"C1",2350,{"$f":"M37*-1000","v":-2350000},null,81008012,"Ledning/Biomedicum FFU","Ledning","Management",{"$f":"SUMIFS($J$37:$J$1375,$A$37:$A$1375,\"39498\",$C$37:$C$1375,LEFT(Bidragsforskning!$D$28,2)&'INDI FO 2025'!$P37)","v":0}]
[49,"C1","C181008001",null,null,null,null,null,null,57000,null,"C2",3320,{"$f":"M38*-1000","v":-3320000},null,82008002,"Utb eller forskningsadmin","Utbildning-forskning","Education-research",{"$f":"SUMIFS($J$37:$J$1375,$A$37:$A$1375,\"39498\",$C$37:$C$1375,LEFT(Bidragsforskning!$D$28,2)&'INDI FO 2025'!$P38)","v":0}]
[50,"C1","C181008001",null,null,null,null,null,null,60000,null,"C3",94,-94000,null,82008012,"FFU Administration Biomedicum","Utbildning-forskning","Education-research",{"$f":"SUMIFS($J$37:$J$1375,$A$37:$A$1375,\"39498\",$C$37:$C$1375,LEFT(Bidragsforskning!$D$28,2)&'INDI FO 2025'!$P39)","v":0}]
[57,"C1","C181008001",null,null,null,null,null,null,30000,null,"C4",1996,-1996000,null,83008002,"Ekonomi-personal","Ekonomi-personal","Finances-staff",{"$f":"SUMIFS($J$37:$J$1375,$A$37:$A$1375,\"39498\",$C$37:$C$1375,LEFT(Bidragsforskning!$D$28,2)&'INDI FO 2025'!$P40)","v":0}]
[69,"C1","C181008001",null,null,null,null,null,null,0,null,"C5",2246.75,-2246750,null,83008012,"Ekonomi/Personal Biomedicum FFU","Ekonomi-personal","Finances-staff",{"$f":"SUMIFS($J$37:$J$1375,$A$37:$A$1375,\"39498\",$C$37:$C$1375,LEFT(Bidragsforskning!$D$28,2)&'INDI FO 2025'!$P41)","v":0}]
[39498,"C1","C181008001",null,null,null,null,null,null,-304424.68499999994,null,"C6",780,-780000,null,84008002,"Infrastruktur","Infrastruktur-service","Infrastructure-service",{"$f":"SUMIFS($J$37:$J$1375,$A$37:$A$1375,\"39498\",$C$37:$C$1375,LEFT(Bidragsforskning!$D$28,2)&'INDI FO 2025'!$P42)","v":0}]
[40,"C1","C181008002",null,null,null,null,null,null,4244834.0250000004,null,"C7",156.6884,-156688.4,null,84008012,"Infrastruktur/Biomedicum GU","Infrastruktur-service","Infrastructure-service",{"$f":"SUMIFS($J$37:$J$1375,$A$37:$A$1375,\"39498\",$C$37:$C$1375,LEFT(Bidragsforskning!$D$28,2)&'INDI FO 2025'!$P43)","v":0}]
[49,"C1","C181008002",null,null,null,null,null,null,500000,null,"C8",0,0,null,null,null,"Bibliotek","Library",{"$f":"SUMIFS($J$37:$J$1375,$A$37:$A$1375,\"39498\",$C$37:$C$1375,LEFT(Bidragsforskning!$D$28,2)&'INDI FO 2025'!$P44)","v":0}]
[50,"C1","C181008002",null,null,null,null,null,null,310000,null,"CC",0,0,null,null,null,"Nivåspecifikt mm","Level specific, etc.",{"$f":"SUMIFS($J$37:$J$1375,$A$37:$A$1375,\"39498\",$C$37:$C$1375,LEFT(Bidragsforskning!$D$28,2)&'INDI FO 2025'!$P45)","v":0}]
[57,"C1","C181008002",null,null,null,null,null,null,1600000,null,"CD",0,0]
[69,"C1","C181008002",null,null,null,null,null,null,0,null,"D1",0,0]
[39498,"C1","C181008002",null,null,null,null,null,null,-6654834.0250000004,null,"H1",1120,-1120000]
[40,"C1","C181008011",null,null,null,null,null,null,0,null,"H5",0,0]
[49,"C1","C181008011",null,null,null,null,null,null,0,null,"H7",4000,-4000000]
[50,"C1","C181008011",null,null,null,null,null,null,0,null,"H9",0,0]
[57,"C1","C181008011",null,null,null,null,null,null,0,null,"K1",1200,-1200000]
[69,"C1","C181008011",null,null,null,null,null,null,0,null,"K2",3584,-3584000]
[39498,"C1","C181008011",null,null,null,null,null,null,0,null,"K6",0,0]
[40,"C1","C181008012",null,null,null,null,null,null,0,null,"K7",1602.9811034499999,-1602981.1034499998]
[49,"C1","C181008012",null,null,null,null,null,null,0,null,"K8",3225,-3225000]
[50,"C1","C181008012",null,null,null,null,null,null,0,null,"K9",182,-182000]
[57,"C1","C181008012",null,null,null,null,null,null,0,null,"OF",0,0]
[69,"C1","C181008012",null,null,null,null,null,null,0,null,"OV",0,0]
[39498,"C1","C181008012",null,null,null,null,null,null,0,null,"S1",220,-220000]
[40,"C1","C182008001",null,null,null,null,null,null,244402.5,null,"TL",0,0]
[49,"C1","C182008001",null,null,null,null,null,null,3000]
[50,"C1","C182008001",null,null,null,null,null,null,53000]
[57,"C1","C182008001",null,null,null,null,null,null,5000]
[69,"C1","C182008001",null,null,null,null,null,null,0]
[39498,"C1","C182008001",null,null,null,null,null,null,-305402.5]
[40,"C1","C182008002",null,null,null,null,null,null,1012233.0000000001]
[49,"C1","C182008002",null,null,null,null,null,null,10000]
[50,"C1","C182008002",null,null,null,null,null,null,150000]
[57,"C1","C182008002",null,null,null,null,null,null,5000]
[69,"C1","C182008002",null,null,null,null,null,null,0]
[39498,"C1","C182008002",null,null,null,null,null,null,-1177233]
[40,"C1","C182008012",null,null,null,null,null,null,0]
[49,"C1","C182008012",null,null,null,null,null,null,0]
[50,"C1","C182008012",null,null,null,null,null,null,0]
[57,"C1","C182008012",null,null,null,null,null,null,0]
[69,"C1","C182008012",null,null,null,null,null,null,0]
[39498,"C1","C182008012",null,null,null,null,null,null,0]
[40,"C1","C183008001",null,null,null,null,null,null,223268.4]
[49,"C1","C183008001",null,null,null,null,null,null,10000]
[50,"C1","C183008001",null,null,null,null,null,null,11000]
[57,"C1","C183008001",null,null,null,null,null,null,30000]
[69,"C1","C183008001",null,null,null,null,null,null,0]
[39498,"C1","C183008001",null,null,null,null,null,null,-274268.40000000002]
[40,"C1","C183008002",null,null,null,null,null,null,6146675.4000000004]
[49,"C1","C183008002",null,null,null,null,null,null,110000]
[50,"C1","C183008002",null,null,null,null,null,null,221000]
[57,"C1","C183008002",null,null,null,null,null,null,1000000]
[69,"C1","C183008002",null,null,null,null,null,null,0]
[39498,"C1","C183008002",null,null,null,null,null,null,-7477675.4000000004]
[40,"C1","C183008011",null,null,null,null,null,null,0]
[49,"C1","C183008011",null,null,null,null,null,null,0]
[50,"C1","C183008011",null,null,null,null,null,null,0]
[57,"C1","C183008011",null,null,null,null,null,null,0]
[69,"C1","C183008011",null,null,null,null,null,null,0]
[39498,"C1","C183008011",null,null,null,null,null,null,0]
[40,"C1","C183008012",null,null,null,null,null,null,0]
[49,"C1","C183008012",null,null,null,null,null,null,0]
[50,"C1","C183008012",null,null,null,null,null,null,0]
[57,"C1","C183008012",null,null,null,null,null,null,0]
[69,"C1","C183008012",null,null,null,null,null,null,0]
[39498,"C1","C183008012",null,null,null,null,null,null,0]
[40,"C1","C184008001",null,null,null,null,null,null,0]
[49,"C1","C184008001",null,null,null,null,null,null,0]
[50,"C1","C184008001",null,null,null,null,null,null,0]
[57,"C1","C184008001",null,null,null,null,null,null,0]
[69,"C1","C184008001",null,null,null,null,null,null,0]
[39498,"C1","C184008001",null,null,null,null,null,null,0]
[40,"C1","C184008002",null,null,null,null,null,null,0]
[49,"C1","C184008002",null,null,null,null,null,null,0]
[50,"C1","C184008002",null,null,null,null,null,null,0]
[57,"C1","C184008002",null,null,null,null,null,null,0]
[69,"C1","C184008002",null,null,null,null,null,null,0]
[39498,"C1","C184008002",null,null,null,null,null,null,0]
[40,"C1","C184008011",null,null,null,null,null,null,0]
[49,"C1","C184008011",null,null,null,null,null,null,0]
[50,"C1","C184008011",null,null,null,null,null,null,0]
[57,"C1","C184008011",null,null,null,null,null,null,0]
[69,"C1","C184008011",null,null,null,null,null,null,0]
[39498,"C1","C184008011",null,null,null,null,null,null,0]
[40,"C1","C184008012",null,null,null,null,null,null,0]
[49,"C1","C184008012",null,null,null,null,null,null,0]
[50,"C1","C184008012",null,null,null,null,null,null,0]
[57,"C1","C184008012",null,null,null,null,null,null,0]
[69,"C1","C184008012",null,null,null,null,null,null,0]
[39498,"C1","C184008012",null,null,null,null,null,null,0]
[40,"C2","C281008001",null,null,null,null,null,null,221580]
[49,"C2","C281008001",null,null,null,null,null,null,3000]
[50,"C2","C281008001",null,null,null,null,null,null,1000]
[57,"C2","C281008001",null,null,null,null,null,null,0]
[69,"C2","C281008001",null,null,null,null,null,null,0]
[39498,"C2","C281008001",null,null,null,null,null,null,-225580]
[40,"C2","C281008002",null,null,null,null,null,null,3992920]
[49,"C2","C281008002",null,null,null,null,null,null,158000]
[50,"C2","C281008002",null,null,null,null,null,null,0]
[57,"C2","C281008002",null,null,null,null,null,null,930000]
[69,"C2","C281008002",null,null,null,null,null,null,0]
[39498,"C2","C281008002",null,null,null,null,null,null,-5080920]
[40,"C2","C282008001",null,null,null,null,null,null,317750]
[49,"C2","C282008001",null,null,null,null,null,null,0]
[50,"C2","C282008001",null,null,null,null,null,null,0]
[57,"C2","C282008001",null,null,null,null,null,null,0]
[69,"C2","C282008001",null,null,null,null,null,null,0]
[39498,"C2","C282008001",null,null,null,null,null,null,-317750]
[40,"C2","C282008002",null,null,null,null,null,null,165600.00000000003]
[49,"C2","C282008002",null,null,null,null,null,null,0]
[50,"C2","C282008002",null,null,null,null,null,null,0]
[57,"C2","C282008002",null,null,null,null,null,null,0]
[69,"C2","C282008002",null,null,null,null,null,null,0]
[39498,"C2","C282008002",null,null,null,null,null,null,-165600.00000000003]
[40,"C2","C283008001",null,null,null,null,null,null,209220.00000000003]
[49,"C2","C283008001",null,null,null,null,null,null,4000]
[50,"C2","C283008001",null,null,null,null,null,null,24000]
[57,"C2","C283008001",null,null,null,null,null,null,28000]
[69,"C2","C283008001",null,null,null,null,null,null,0]
[39498,"C2","C283008001",null,null,null,null,null,null,-265220]
[40,"C2","C283008002",null,null,null,null,null,null,6455280]
[49,"C2","C283008002",null,null,null,null,null,null,68000]
[50,"C2","C283008002",null,null,null,null,null,null,570000]
[57,"C2","C283008002",null,null,null,null,null,null,783000]
[69,"C2","C283008002",null,null,null,null,null,null,0]
[39498,"C2","C283008002",null,null,null,null,null,null,-7876280]
[40,"C2","C284008001",null,null,null,null,null,null,15100]
[49,"C2","C284008001",null,null,null,null,null,null,0]
[50,"C2","C284008001",null,null,null,null,null,null,0]
[57,"C2","C284008001",null,null,null,null,null,null,14000]
[69,"C2","C284008001",null,null,null,null,null,null,0]
[39498,"C2","C284008001",null,null,null,null,null,null,-29100]
[40,"C2","C284008002",null,null,null,null,null,null,238700.00000000003]
[49,"C2","C284008002",null,null,null,null,null,null,2000]
[50,"C2","C284008002",null,null,null,null,null,null,0]
[57,"C2","C284008002",null,null,null,null,null,null,360000]
[69,"C2","C284008002",null,null,null,null,null,null,0]
[39498,"C2","C284008002",null,null,null,null,null,null,-600700]
[40,"C2","C284008011",null,null,null,null,null,null,0]
[49,"C2","C284008011",null,null,null,null,null,null,0]
[50,"C2","C284008011",null,null,null,null,null,null,0]
[57,"C2","C284008011",null,null,null,null,null,null,0]
[69,"C2","C284008011",null,null,null,null,null,null,0]
[39498,"C2","C284008011",null,null,null,null,null,null,0]
[40,"C2","C284008012",null,null,null,null,null,null,0]
[49,"C2","C284008012",null,null,null,null,null,null,50000]
[50,"C2","C284008012",null,null,null,null,null,null,0]
[57,"C2","C284008012",null,null,null,null,null,null,40000]
[69,"C2","C284008012",null,null,null,null,null,null,100000]
[39498,"C2","C284008012",null,null,null,null,null,null,-190000]
[40,"C3","C381008001",null,null,null,null,null,null,660330.22499999998]
[49,"C3","C381008001",null,null,null,null,null,null,70000]
[50,"C3","C381008001",null,null,null,null,null,null,38220]
[57,"C3","C381008001",null,null,null,null,null,null,20000]
[69,"C3","C381008001",null,null,null,null,null,null,0]
[39498,"C3","C381008001",null,null,null,null,null,null,-788550.22499999998]
[40,"C3","C381008002",null,null,null,null,null,null,3508052.7450000001]
[49,"C3","C381008002",null,null,null,null,null,null,225000]
[50,"C3","C381008002",null,null,null,null,null,null,152880]
[57,"C3","C381008002",null,null,null,null,null,null,250000]
[69,"C3","C381008002",null,null,null,null,null,null,0]
[39498,"C3","C381008002",null,null,null,null,null,null,-4135932.7450000001]
[40,"C3","C382008001",null,null,null,null,null,null,1123176.7439999999]
[49,"C3","C382008001",null,null,null,null,null,null,5000]
[50,"C3","C382008001",null,null,null,null,null,null,281400.00000000006]
[57,"C3","C382008001",null,null,null,null,null,null,12000]
[69,"C3","C382008001",null,null,null,null,null,null,0]
[39498,"C3","C382008001",null,null,null,null,null,null,-1421576.7439999999]
[40,"C3","C382008002",null,null,null,null,null,null,1372469.5079999999]
[49,"C3","C382008002",null,null,null,null,null,null,15000]
[50,"C3","C382008002",null,null,null,null,null,null,58800.000000000007]
[57,"C3","C382008002",null,null,null,null,null,null,42000]
[69,"C3","C382008002",null,null,null,null,null,null,0]
[39498,"C3","C382008002",null,null,null,null,null,null,-1488269.5079999999]
[40,"C3","C383008001",null,null,null,null,null,null,198127.46879999997]
[49,"C3","C383008001",null,null,null,null,null,null,20840.000000000004]
[50,"C3","C383008001",null,null,null,null,null,null,0]
[57,"C3","C383008001",null,null,null,null,null,null,84000]
[69,"C3","C383008001",null,null,null,null,null,null,0]
[39498,"C3","C383008001",null,null,null,null,null,null,-302967.46879999997]
[40,"C3","C383008002",null,null,null,null,null,null,4723014.7661999995]
[49,"C3","C383008002",null,null,null,null,null,null,83360.000000000015]
[50,"C3","C383008002",null,null,null,null,null,null,281400.00000000006]
[57,"C3","C383008002",null,null,null,null,null,null,336000]
[69,"C3","C383008002",null,null,null,null,null,null,0]
[39498,"C3","C383008002",null,null,null,null,null,null,-5423774.7661999995]
[40,"C3","C384008001",null,null,null,null,null,null,0]
[49,"C3","C384008001",null,null,null,null,null,null,0]
[50,"C3","C384008001",null,null,null,null,null,null,0]
[57,"C3","C384008001",null,null,null,null,null,null,79300.000000000015]
[69,"C3","C384008001",null,null,null,null,null,null,0]
[39498,"C3","C384008001",null,null,null,null,null,null,-79300.000000000015]
[40,"C3","C384008002",null,null,null,null,null,null,0]
[49,"C3","C384008002",null,null,null,null,null,null,0]
[50,"C3","C384008002",null,null,null,null,null,null,0]
[57,"C3","C384008002",null,null,null,null,null,null,417200.00000000006]
[69,"C3","C384008002",null,null,null,null,null,null,0]
[39498,"C3","C384008002",null,null,null,null,null,null,-417200.00000000006]
[40,"C4","C481008001",null,null,null,null,null,null,513331.25183999992]
[49,"C4","C481008001",null,null,null,null,null,null,0]
[50,"C4","C481008001",null,null,null,null,null,null,7175]
[57,"C4","C481008001",null,null,null,null,null,null,10000]
[69,"C4","C481008001",null,null,null,null,null,null,0]
[39498,"C4","C481008001",null,null,null,null,null,null,-530506.25183999992]
[40,"C4","C481008002",null,null,null,null,null,null,2975182.3804560001]
[49,"C4","C481008002",null,null,null,null,null,null,10000]
[50,"C4","C481008002",null,null,null,null,null,null,64575]
[57,"C4","C481008002",null,null,null,null,null,null,470000]
[69,"C4","C481008002",null,null,null,null,null,null,0]
[39498,"C4","C481008002",null,null,null,null,null,null,-3519757.3804560001]
[40,"C4","C482008001",null,null,null,null,null,null,583817.07713999995]
[49,"C4","C482008001",null,null,null,null,null,null,0]
[50,"C4","C482008001",null,null,null,null,null,null,50000]
[57,"C4","C482008001",null,null,null,null,null,null,10000]
[69,"C4","C482008001",null,null,null,null,null,null,0]
[39498,"C4","C482008001",null,null,null,null,null,null,-643817.07713999995]
[40,"C4","C482008002",null,null,null,null,null,null,198818.63826000001]
[49,"C4","C482008002",null,null,null,null,null,null,0]
[50,"C4","C482008002",null,null,null,null,null,null,0]
[57,"C4","C482008002",null,null,null,null,null,null,5000]
[69,"C4","C482008002",null,null,null,null,null,null,0]
[39498,"C4","C482008002",null,null,null,null,null,null,-203818.63826000001]
[40,"C4","C483008001",null,null,null,null,null,null,360109.65091199998]
[49,"C4","C483008001",null,null,null,null,null,null,5000]
[50,"C4","C483008001",null,null,null,null,null,null,31000]
[57,"C4","C483008001",null,null,null,null,null,null,52000]
[69,"C4","C483008001",null,null,null,null,null,null,0]
[39498,"C4","C483008001",null,null,null,null,null,null,-448109.65091199998]
[40,"C4","C483008002",null,null,null,null,null,null,3240986.8582079993]
[49,"C4","C483008002",null,null,null,null,null,null,150000]
[50,"C4","C483008002",null,null,null,null,null,null,288000]
[57,"C4","C483008002",null,null,null,null,null,null,1956000]
[69,"C4","C483008002",null,null,null,null,null,null,0]
[39498,"C4","C483008002",null,null,null,null,null,null,-5634986.8582079988]
[40,"C4","C484008001",null,null,null,null,null,null,0]
[49,"C4","C484008001",null,null,null,null,null,null,0]
[50,"C4","C484008001",null,null,null,null,null,null,0]
[57,"C4","C484008001",null,null,null,null,null,null,0]
[69,"C4","C484008001",null,null,null,null,null,null,0]
[39498,"C4","C484008001",null,null,null,null,null,null,0]
[40,"C4","C484008002",null,null,null,null,null,null,0]
[49,"C4","C484008002",null,null,null,null,null,null,0]
[50,"C4","C484008002",null,null,null,null,null,null,0]
[57,"C4","C484008002",null,null,null,null,null,null,0]
[69,"C4","C484008002",null,null,null,null,null,null,0]
[39498,"C4","C484008002",null,null,null,null,null,null,0]
[40,"C4","C484008011",null,null,null,null,null,null,0]
[49,"C4","C484008011",null,null,null,null,null,null,0]
[50,"C4","C484008011",null,null,null,null,null,null,0]
[57,"C4","C484008011",null,null,null,null,null,null,0]
[69,"C4","C484008011",null,null,null,null,null,null,0]
[39498,"C4","C484008011",null,null,null,null,null,null,0]
[40,"C4","C484008012",null,null,null,null,null,null,0]
[49,"C4","C484008012",null,null,null,null,null,null,0]
[50,"C4","C484008012",null,null,null,null,null,null,0]
[57,"C4","C484008012",null,null,null,null,null,null,0]
[69,"C4","C484008012",null,null,null,null,null,null,0]
[39498,"C4","C484008012",null,null,null,null,null,null,0]
[40,"C5","C581008001",null,null,null,null,null,null,66470]
[49,"C5","C581008001",null,null,null,null,null,null,0]
[50,"C5","C581008001",null,null,null,null,null,null,0]
[57,"C5","C581008001",null,null,null,null,null,null,0]
[69,"C5","C581008001",null,null,null,null,null,null,0]
[39498,"C5","C581008001",null,null,null,null,null,null,-66470]
[40,"C5","C581008002",null,null,null,null,null,null,2497410]
[49,"C5","C581008002",null,null,null,null,null,null,0]
[50,"C5","C581008002",null,null,null,null,null,null,0]
[57,"C5","C581008002",null,null,null,null,null,null,0]
[69,"C5","C581008002",null,null,null,null,null,null,0]
[39498,"C5","C581008002",null,null,null,null,null,null,-2497410]
[40,"C5","C582008001",null,null,null,null,null,null,124842.11]
[49,"C5","C582008001",null,null,null,null,null,null,0]
[50,"C5","C582008001",null,null,null,null,null,null,0]
[57,"C5","C582008001",null,null,null,null,null,null,0]
[69,"C5","C582008001",null,null,null,null,null,null,0]
[39498,"C5","C582008001",null,null,null,null,null,null,-124842.11]
[40,"C5","C582008002",null,null,null,null,null,null,174371.08999999997]
[49,"C5","C582008002",null,null,null,null,null,null,0]
[50,"C5","C582008002",null,null,null,null,null,null,0]
[57,"C5","C582008002",null,null,null,null,null,null,0]
[69,"C5","C582008002",null,null,null,null,null,null,0]
[39498,"C5","C582008002",null,null,null,null,null,null,-174371.08999999997]
[40,"C5","C583008001",null,null,null,null,null,null,246573.78]
[49,"C5","C583008001",null,null,null,null,null,null,0]
[50,"C5","C583008001",null,null,null,null,null,null,0]
[57,"C5","C583008001",null,null,null,null,null,null,0]
[69,"C5","C583008001",null,null,null,null,null,null,0]
[39498,"C5","C583008001",null,null,null,null,null,null,-246573.78]
[40,"C5","C583008002",null,null,null,null,null,null,6105797.8199999994]
[49,"C5","C583008002",null,null,null,null,null,null,50000]
[50,"C5","C583008002",null,null,null,null,null,null,385000]
[57,"C5","C583008002",null,null,null,null,null,null,600000]
[69,"C5","C583008002",null,null,null,null,null,null,0]
[39498,"C5","C583008002",null,null,null,null,null,null,-7140797.8199999994]
[40,"C5","C584008001",null,null,null,null,null,null,0]
[49,"C5","C584008001",null,null,null,null,null,null,0]
[50,"C5","C584008001",null,null,null,null,null,null,0]
[57,"C5","C584008001",null,null,null,null,null,null,0]
[69,"C5","C584008001",null,null,null,null,null,null,0]
[39498,"C5","C584008001",null,null,null,null,null,null,0]
[40,"C5","C584008002",null,null,null,null,null,null,0]
[49,"C5","C584008002",null,null,null,null,null,null,0]
[50,"C5","C584008002",null,null,null,null,null,null,0]
[57,"C5","C584008002",null,null,null,null,null,null,0]
[69,"C5","C584008002",null,null,null,null,null,null,0]
[39498,"C5","C584008002",null,null,null,null,null,null,0]
[40,"C5","C584008011",null,null,null,null,null,null,0]
[49,"C5","C584008011",null,null,null,null,null,null,0]
[50,"C5","C584008011",null,null,null,null,null,null,0]
[57,"C5","C584008011",null,null,null,null,null,null,0]
[69,"C5","C584008011",null,null,null,null,null,null,0]
[39498,"C5","C584008011",null,null,null,null,null,null,0]
[40,"C5","C584008012",null,null,null,null,null,null,0]
[49,"C5","C584008012",null,null,null,null,null,null,0]
[50,"C5","C584008012",null,null,null,null,null,null,0]
[57,"C5","C584008012",null,null,null,null,null,null,0]
[69,"C5","C584008012",null,null,null,null,null,null,0]
[39498,"C5","C584008012",null,null,null,null,null,null,0]
[40,"C6","C681008001",null,null,null,null,null,null,66733.113600000012]
[49,"C6","C681008001",null,null,null,null,null,null,0]
[50,"C6","C681008001",null,null,null,null,null,null,0]
[57,"C6","C681008001",null,null,null,null,null,null,0]
[69,"C6","C681008001",null,null,null,null,null,null,0]
[39498,"C6","C681008001",null,null,null,null,null,null,-66733.113600000012]
[40,"C6","C681008002",null,null,null,null,null,null,3128281.8624]
[49,"C6","C681008002",null,null,null,null,null,null,20000]
[50,"C6","C681008002",null,null,null,null,null,null,60000]
[57,"C6","C681008002",null,null,null,null,null,null,100000]
[69,"C6","C681008002",null,null,null,null,null,null,0]
[39498,"C6","C681008002",null,null,null,null,null,null,-3308281.8624]
[40,"C6","C682008001",null,null,null,null,null,null,1636609.3631999998]
[49,"C6","C682008001",null,null,null,null,null,null,0]
[50,"C6","C682008001",null,null,null,null,null,null,133800]
[57,"C6","C682008001",null,null,null,null,null,null,76759.999999999985]
[69,"C6","C682008001",null,null,null,null,null,null,0]
[39498,"C6","C682008001",null,null,null,null,null,null,-1847169.3631999998]
[40,"C6","C682008002",null,null,null,null,null,null,1117680.7679999999]
[49,"C6","C682008002",null,null,null,null,null,null,30000]
[50,"C6","C682008002",null,null,null,null,null,null,106200]
[57,"C6","C682008002",null,null,null,null,null,null,71240.000000000015]
[69,"C6","C682008002",null,null,null,null,null,null,0]
[39498,"C6","C682008002",null,null,null,null,null,null,-1325120.7679999999]
[40,"C6","C683008001",null,null,null,null,null,null,216661.30560000002]
[49,"C6","C683008001",null,null,null,null,null,null,0]
[50,"C6","C683008001",null,null,null,null,null,null,0]
[57,"C6","C683008001",null,null,null,null,null,null,20000]
[69,"C6","C683008001",null,null,null,null,null,null,0]
[39498,"C6","C683008001",null,null,null,null,null,null,-236661.30560000002]
[40,"C6","C683008002",null,null,null,null,null,null,6655016.1024000002]
[49,"C6","C683008002",null,null,null,null,null,null,0]
[50,"C6","C683008002",null,null,null,null,null,null,585000]
[57,"C6","C683008002",null,null,null,null,null,null,540000]
[69,"C6","C683008002",null,null,null,null,null,null,0]
[39498,"C6","C683008002",null,null,null,null,null,null,-7780016.1024000002]
[40,"C6","C684008001",null,null,null,null,null,null,0]
[49,"C6","C684008001",null,null,null,null,null,null,0]
[50,"C6","C684008001",null,null,null,null,null,null,0]
[57,"C6","C684008001",null,null,null,null,null,null,0]
[69,"C6","C684008001",null,null,null,null,null,null,0]
[39498,"C6","C684008001",null,null,null,null,null,null,0]
[40,"C6","C684008002",null,null,null,null,null,null,1206959.6160000002]
[49,"C6","C684008002",null,null,null,null,null,null,0]
[50,"C6","C684008002",null,null,null,null,null,null,90000]
[57,"C6","C684008002",null,null,null,null,null,null,25000]
[69,"C6","C684008002",null,null,null,null,null,null,0]
[39498,"C6","C684008002",null,null,null,null,null,null,-1321959.6160000002]
[40,"C7","C781008001",null,null,null,null,null,null,647039.54700000002]
[49,"C7","C781008001",null,null,null,null,null,null,239766]
[50,"C7","C781008001",null,null,null,null,null,null,0]
[57,"C7","C781008001",null,null,null,null,null,null,89352.66]
[69,"C7","C781008001",null,null,null,null,null,null,0]
[39498,"C7","C781008001",null,null,null,null,null,null,-976158.20700000005]
[40,"C7","C781008002",null,null,null,null,null,null,1735184.2529999998]
[49,"C7","C781008002",null,null,null,null,null,null,308254]
[50,"C7","C781008002",null,null,null,null,null,null,0]
[57,"C7","C781008002",null,null,null,null,null,null,77002.115999999995]
[69,"C7","C781008002",null,null,null,null,null,null,0]
[39498,"C7","C781008002",null,null,null,null,null,null,-2120440.3689999999]
[40,"C7","C782008001",null,null,null,null,null,null,218534.58000000005]
[49,"C7","C782008001",null,null,null,null,null,null,93860]
[50,"C7","C782008001",null,null,null,null,null,null,0]
[57,"C7","C782008001",null,null,null,null,null,null,42729.695999999996]
[69,"C7","C782008001",null,null,null,null,null,null,0]
[39498,"C7","C782008001",null,null,null,null,null,null,-355124.27600000007]
[40,"C7","C782008002",null,null,null,null,null,null,0]
[49,"C7","C782008002",null,null,null,null,null,null,65680]
[50,"C7","C782008002",null,null,null,null,null,null,0]
[57,"C7","C782008002",null,null,null,null,null,null,5664.0240000000003]
[69,"C7","C782008002",null,null,null,null,null,null,0]
[39498,"C7","C782008002",null,null,null,null,null,null,-71344.024000000005]
[40,"C7","C783008001",null,null,null,null,null,null,1102319.922]
[49,"C7","C783008001",null,null,null,null,null,null,26100]
[50,"C7","C783008001",null,null,null,null,null,null,0]
[57,"C7","C783008001",null,null,null,null,null,null,154817.70799999998]
[69,"C7","C783008001",null,null,null,null,null,null,0]
[39498,"C7","C783008001",null,null,null,null,null,null,-1283237.6299999999]
[40,"C7","C783008002",null,null,null,null,null,null,3218167.7879999992]
[49,"C7","C783008002",null,null,null,null,null,null,76030]
[50,"C7","C783008002",null,null,null,null,null,null,0]
[57,"C7","C783008002",null,null,null,null,null,null,572772.22]
[69,"C7","C783008002",null,null,null,null,null,null,0]
[39498,"C7","C783008002",null,null,null,null,null,null,-3866970.0079999994]
[40,"C7","C784008001",null,null,null,null,null,null,303093.68099999992]
[49,"C7","C784008001",null,null,null,null,null,null,2400]
[50,"C7","C784008001",null,null,null,null,null,null,0]
[57,"C7","C784008001",null,null,null,null,null,null,24751.495999999999]
[69,"C7","C784008001",null,null,null,null,null,null,0]
[39498,"C7","C784008001",null,null,null,null,null,null,-330245.17699999991]
[40,"C7","C784008002",null,null,null,null,null,null,614308.57949999988]
[49,"C7","C784008002",null,null,null,null,null,null,5600]
[50,"C7","C784008002",null,null,null,null,null,null,0]
[57,"C7","C784008002",null,null,null,null,null,null,61418.308000000005]
[69,"C7","C784008002",null,null,null,null,null,null,0]
[39498,"C7","C784008002",null,null,null,null,null,null,-681326.88749999984]
[40,"C8","C881008001",null,null,null,null,null,null,123200]
[49,"C8","C881008001",null,null,null,null,null,null,5000]
[50,"C8","C881008001",null,null,null,null,null,null,9000]
[57,"C8","C881008001",null,null,null,null,null,null,0]
[69,"C8","C881008001",null,null,null,null,null,null,0]
[39498,"C8","C881008001",null,null,null,null,null,null,-137200]
[40,"C8","C881008002",null,null,null,null,null,null,2310050]
[49,"C8","C881008002",null,null,null,null,null,null,25000]
[50,"C8","C881008002",null,null,null,null,null,null,118000]
[57,"C8","C881008002",null,null,null,null,null,null,40000]
[69,"C8","C881008002",null,null,null,null,null,null,0]
[39498,"C8","C881008002",null,null,null,null,null,null,-2493050]
[40,"C8","C882008001",null,null,null,null,null,null,325000]
[49,"C8","C882008001",null,null,null,null,null,null,5000]
[50,"C8","C882008001",null,null,null,null,null,null,18000]
[57,"C8","C882008001",null,null,null,null,null,null,0]
[69,"C8","C882008001",null,null,null,null,null,null,0]
[39498,"C8","C882008001",null,null,null,null,null,null,-348000]
[40,"C8","C882008002",null,null,null,null,null,null,1116000]
[49,"C8","C882008002",null,null,null,null,null,null,25000]
[50,"C8","C882008002",null,null,null,null,null,null,78000]
[57,"C8","C882008002",null,null,null,null,null,null,20000]
[69,"C8","C882008002",null,null,null,null,null,null,0]
[39498,"C8","C882008002",null,null,null,null,null,null,-1239000]
[40,"C8","C883008001",null,null,null,null,null,null,366200]
[49,"C8","C883008001",null,null,null,null,null,null,5000]
[50,"C8","C883008001",null,null,null,null,null,null,32000]
[57,"C8","C883008001",null,null,null,null,null,null,0]
[69,"C8","C883008001",null,null,null,null,null,null,0]
[39498,"C8","C883008001",null,null,null,null,null,null,-403200]
[40,"C8","C883008002",null,null,null,null,null,null,9528800.0000000019]
[49,"C8","C883008002",null,null,null,null,null,null,160000]
[50,"C8","C883008002",null,null,null,null,null,null,808000]
[57,"C8","C883008002",null,null,null,null,null,null,685000]
[69,"C8","C883008002",null,null,null,null,null,null,0]
[39498,"C8","C883008002",null,null,null,null,null,null,-11181800.000000002]
[40,"C8","C884008001",null,null,null,null,null,null,70000]
[49,"C8","C884008001",null,null,null,null,null,null,5000]
[50,"C8","C884008001",null,null,null,null,null,null,16000]
[57,"C8","C884008001",null,null,null,null,null,null,0]
[69,"C8","C884008001",null,null,null,null,null,null,0]
[39498,"C8","C884008001",null,null,null,null,null,null,-91000]
[40,"C8","C884008002",null,null,null,null,null,null,1815000]
[49,"C8","C884008002",null,null,null,null,null,null,25000]
[50,"C8","C884008002",null,null,null,null,null,null,530000]
[57,"C8","C884008002",null,null,null,null,null,null,60000]
[69,"C8","C884008002",null,null,null,null,null,null,0]
[39498,"C8","C884008002",null,null,null,null,null,null,-2430000]
[40,"C8","C884008011",null,null,null,null,null,null,293200]
[49,"C8","C884008011",null,null,null,null,null,null,0]
[50,"C8","C884008011",null,null,null,null,null,null,29000]
[57,"C8","C884008011",null,null,null,null,null,null,0]
[69,"C8","C884008011",null,null,null,null,null,null,0]
[39498,"C8","C884008011",null,null,null,null,null,null,-322200]
[40,"C8","C884008012",null,null,null,null,null,null,7371800]
[49,"C8","C884008012",null,null,null,null,null,null,90000]
[50,"C8","C884008012",null,null,null,null,null,null,684000]
[57,"C8","C884008012",null,null,null,null,null,null,220000]
[69,"C8","C884008012",null,null,null,null,null,null,0]
[39498,"C8","C884008012",null,null,null,null,null,null,-8365800]
[40,"CC","CC81008002",null,null,null,null,null,null,1056000]
[49,"CC","CC81008002",null,null,null,null,null,null,200000]
[50,"CC","CC81008002",null,null,null,null,null,null,30000]
[57,"CC","CC81008002",null,null,null,null,null,null,220000]
[69,"CC","CC81008002",null,null,null,null,null,null,0]
[39498,"CC","CC81008002",null,null,null,null,null,null,-1506000]
[40,"CC","CC82008001",null,null,null,null,null,null,42640]
[49,"CC","CC82008001",null,null,null,null,null,null,1000]
[50,"CC","CC82008001",null,null,null,null,null,null,0]
[57,"CC","CC82008001",null,null,null,null,null,null,520]
[69,"CC","CC82008001",null,null,null,null,null,null,0]
[39498,"CC","CC82008001",null,null,null,null,null,null,-44160]
[40,"CC","CC82008002",null,null,null,null,null,null,902000]
[49,"CC","CC82008002",null,null,null,null,null,null,16000]
[50,"CC","CC82008002",null,null,null,null,null,null,0]
[57,"CC","CC82008002",null,null,null,null,null,null,15000]
[69,"CC","CC82008002",null,null,null,null,null,null,0]
[39498,"CC","CC82008002",null,null,null,null,null,null,-933000]
[40,"CC","CC83008002",null,null,null,null,null,null,3302000]
[49,"CC","CC83008002",null,null,null,null,null,null,60000]
[50,"CC","CC83008002",null,null,null,null,null,null,0]
[57,"CC","CC83008002",null,null,null,null,null,null,280000]
[69,"CC","CC83008002",null,null,null,null,null,null,0]
[39498,"CC","CC83008002",null,null,null,null,null,null,-3642000]
[40,"CC","CC84008002",null,null,null,null,null,null,2342000]
[49,"CC","CC84008002",null,null,null,null,null,null,50000]
[50,"CC","CC84008002",null,null,null,null,null,null,80000]
[57,"CC","CC84008002",null,null,null,null,null,null,150000]
[69,"CC","CC84008002",null,null,null,null,null,null,0]
[39498,"CC","CC84008002",null,null,null,null,null,null,-2622000]
[40,"CC","CC84008012",null,null,null,null,null,null,-1047000]
[49,"CC","CC84008012",null,null,null,null,null,null,27000]
[50,"CC","CC84008012",null,null,null,null,null,null,0]
[57,"CC","CC84008012",null,null,null,null,null,null,1020000]
[69,"CC","CC84008012",null,null,null,null,null,null,0]
[39498,"CC","CC84008012",null,null,null,null,null,null,0]
[40,"D1","D181008001",null,null,null,null,null,null,339000]
[49,"D1","D181008001",null,null,null,null,null,null,60000]
[50,"D1","D181008001",null,null,null,null,null,null,0]
[57,"D1","D181008001",null,null,null,null,null,null,6900]
[69,"D1","D181008001",null,null,null,null,null,null,0]
[39498,"D1","D181008001",null,null,null,null,null,null,-405900]
[40,"D1","D181008002",null,null,null,null,null,null,339000]
[49,"D1","D181008002",null,null,null,null,null,null,60000]
[50,"D1","D181008002",null,null,null,null,null,null,0]
[57,"D1","D181008002",null,null,null,null,null,null,6900]
[69,"D1","D181008002",null,null,null,null,null,null,0]
[39498,"D1","D181008002",null,null,null,null,null,null,-405900]
[40,"D1","D182008001",null,null,null,null,null,null,438500]
[49,"D1","D182008001",null,null,null,null,null,null,0]
[50,"D1","D182008001",null,null,null,null,null,null,0]
[57,"D1","D182008001",null,null,null,null,null,null,16000]
[69,"D1","D182008001",null,null,null,null,null,null,0]
[39498,"D1","D182008001",null,null,null,null,null,null,-454500]
[40,"D1","D182008002",null,null,null,null,null,null,934000]
[49,"D1","D182008002",null,null,null,null,null,null,0]
[50,"D1","D182008002",null,null,null,null,null,null,0]
[57,"D1","D182008002",null,null,null,null,null,null,30000]
[69,"D1","D182008002",null,null,null,null,null,null,0]
[39498,"D1","D182008002",null,null,null,null,null,null,-964000]
[40,"D1","D183008001",null,null,null,null,null,null,481750]
[49,"D1","D183008001",null,null,null,null,null,null,0]
[50,"D1","D183008001",null,null,null,null,null,null,0]
[57,"D1","D183008001",null,null,null,null,null,null,174000]
[69,"D1","D183008001",null,null,null,null,null,null,0]
[39498,"D1","D183008001",null,null,null,null,null,null,-655750]
[40,"D1","D183008002",null,null,null,null,null,null,1642250]
[49,"D1","D183008002",null,null,null,null,null,null,0]
[50,"D1","D183008002",null,null,null,null,null,null,0]
[57,"D1","D183008002",null,null,null,null,null,null,174000]
[69,"D1","D183008002",null,null,null,null,null,null,0]
[39498,"D1","D183008002",null,null,null,null,null,null,-1816250]
[40,"D1","D184008001",null,null,null,null,null,null,265000]
[49,"D1","D184008001",null,null,null,null,null,null,0]
[50,"D1","D184008001",null,null,null,null,null,null,0]
[57,"D1","D184008001",null,null,null,null,null,null,5000]
[69,"D1","D184008001",null,null,null,null,null,null,0]
[39498,"D1","D184008001",null,null,null,null,null,null,-270000]
[40,"D1","D184008002",null,null,null,null,null,null,534000]
[49,"D1","D184008002",null,null,null,null,null,null,10000]
[50,"D1","D184008002",null,null,null,null,null,null,0]
[57,"D1","D184008002",null,null,null,null,null,null,9000]
[69,"D1","D184008002",null,null,null,null,null,null,0]
[39498,"D1","D184008002",null,null,null,null,null,null,-553000]
[40,"H1","H181008001",null,null,null,null,null,null,2385950]
[49,"H1","H181008001",null,null,null,null,null,null,133000]
[50,"H1","H181008001",null,null,null,null,null,null,179000]
[57,"H1","H181008001",null,null,null,null,null,null,0]
[69,"H1","H181008001",null,null,null,null,null,null,0]
[39498,"H1","H181008001",null,null,null,null,null,null,-2697950]
[40,"H1","H181008002",null,null,null,null,null,null,1837550]
[49,"H1","H181008002",null,null,null,null,null,null,10983000]
[50,"H1","H181008002",null,null,null,null,null,null,179000]
[57,"H1","H181008002",null,null,null,null,null,null,0]
[69,"H1","H181008002",null,null,null,null,null,null,0]
[39498,"H1","H181008002",null,null,null,null,null,null,-12999550]
[40,"H1","H182008001",null,null,null,null,null,null,1496000]
[49,"H1","H182008001",null,null,null,null,null,null,0]
[50,"H1","H182008001",null,null,null,null,null,null,0]
[57,"H1","H182008001",null,null,null,null,null,null,0]
[69,"H1","H182008001",null,null,null,null,null,null,0]
[39498,"H1","H182008001",null,null,null,null,null,null,-1496000]
[40,"H1","H182008002",null,null,null,null,null,null,483900]
[49,"H1","H182008002",null,null,null,null,null,null,0]
[50,"H1","H182008002",null,null,null,null,null,null,0]
[57,"H1","H182008002",null,null,null,null,null,null,0]
[69,"H1","H182008002",null,null,null,null,null,null,0]
[39498,"H1","H182008002",null,null,null,null,null,null,-483900]
[40,"H1","H183008001",null,null,null,null,null,null,3758800]
[49,"H1","H183008001",null,null,null,null,null,null,44000]
[50,"H1","H183008001",null,null,null,null,null,null,597000]
[57,"H1","H183008001",null,null,null,null,null,null,454000]
[69,"H1","H183008001",null,null,null,null,null,null,0]
[39498,"H1","H183008001",null,null,null,null,null,null,-4853800]
[40,"H1","H183008002",null,null,null,null,null,null,4559800]
[49,"H1","H183008002",null,null,null,null,null,null,44000]
[50,"H1","H183008002",null,null,null,null,null,null,597000]
[57,"H1","H183008002",null,null,null,null,null,null,516500]
[69,"H1","H183008002",null,null,null,null,null,null,0]
[39498,"H1","H183008002",null,null,null,null,null,null,-5717300]
[40,"H1","H184008001",null,null,null,null,null,null,1411000]
[49,"H1","H184008001",null,null,null,null,null,null,18000]
[50,"H1","H184008001",null,null,null,null,null,null,239000]
[57,"H1","H184008001",null,null,null,null,null,null,171500]
[69,"H1","H184008001",null,null,null,null,null,null,0]
[39498,"H1","H184008001",null,null,null,null,null,null,-1839500]
[40,"H1","H184008002",null,null,null,null,null,null,1496000]
[49,"H1","H184008002",null,null,null,null,null,null,18000]
[50,"H1","H184008002",null,null,null,null,null,null,239000]
[57,"H1","H184008002",null,null,null,null,null,null,171500]
[69,"H1","H184008002",null,null,null,null,null,null,0]
[39498,"H1","H184008002",null,null,null,null,null,null,-1924500]
[40,"H5","H581008001",null,null,null,null,null,null,553331.49300000002]
[49,"H5","H581008001",null,null,null,null,null,null,0]
[50,"H5","H581008001",null,null,null,null,null,null,53480]
[57,"H5","H581008001",null,null,null,null,null,null,35000]
[69,"H5","H581008001",null,null,null,null,null,null,0]
[39498,"H5","H581008001",null,null,null,null,null,null,-641811.49300000002]
[40,"H5","H581008002",null,null,null,null,null,null,3291796.5101999994]
[49,"H5","H581008002",null,null,null,null,null,null,5000]
[50,"H5","H581008002",null,null,null,null,null,null,123000]
[57,"H5","H581008002",null,null,null,null,null,null,35000]
[69,"H5","H581008002",null,null,null,null,null,null,0]
[39498,"H5","H581008002",null,null,null,null,null,null,-3454796.5101999994]
[40,"H5","H582008001",null,null,null,null,null,null,3313935.4168799999]
[49,"H5","H582008001",null,null,null,null,null,null,0]
[50,"H5","H582008001",null,null,null,null,null,null,284500]
[57,"H5","H582008001",null,null,null,null,null,null,70000]
[69,"H5","H582008001",null,null,null,null,null,null,0]
[39498,"H5","H582008001",null,null,null,null,null,null,-3668435.4168799999]
[40,"H5","H582008002",null,null,null,null,null,null,1205411.3755199998]
[49,"H5","H582008002",null,null,null,null,null,null,0]
[50,"H5","H582008002",null,null,null,null,null,null,49000]
[57,"H5","H582008002",null,null,null,null,null,null,25000]
[69,"H5","H582008002",null,null,null,null,null,null,0]
[39498,"H5","H582008002",null,null,null,null,null,null,-1279411.3755199998]
[40,"H5","H583008001",null,null,null,null,null,null,1109391.1735499999]
[49,"H5","H583008001",null,null,null,null,null,null,2000]
[50,"H5","H583008001",null,null,null,null,null,null,174000]
[57,"H5","H583008001",null,null,null,null,null,null,50000]
[69,"H5","H583008001",null,null,null,null,null,null,0]
[39498,"H5","H583008001",null,null,null,null,null,null,-1335391.1735499999]
[40,"H5","H583008002",null,null,null,null,null,null,4110975.5390219996]
[49,"H5","H583008002",null,null,null,null,null,null,744000]
[50,"H5","H583008002",null,null,null,null,null,null,220000]
[57,"H5","H583008002",null,null,null,null,null,null,480000]
[69,"H5","H583008002",null,null,null,null,null,null,0]
[39498,"H5","H583008002",null,null,null,null,null,null,-5554975.5390219996]
[40,"H5","H584008001",null,null,null,null,null,null,0]
[49,"H5","H584008001",null,null,null,null,null,null,0]
[50,"H5","H584008001",null,null,null,null,null,null,0]
[57,"H5","H584008001",null,null,null,null,null,null,0]
[69,"H5","H584008001",null,null,null,null,null,null,0]
[39498,"H5","H584008001",null,null,null,null,null,null,0]
[40,"H5","H584008002",null,null,null,null,null,null,93451.541039999996]
[49,"H5","H584008002",null,null,null,null,null,null,0]
[50,"H5","H584008002",null,null,null,null,null,null,2000]
[57,"H5","H584008002",null,null,null,null,null,null,25000]
[69,"H5","H584008002",null,null,null,null,null,null,0]
[39498,"H5","H584008002",null,null,null,null,null,null,-120451.54104]
[40,"H7","H781008001",null,null,null,null,null,null,99160]
[49,"H7","H781008001",null,null,null,null,null,null,0]
[50,"H7","H781008001",null,null,null,null,null,null,0]
[57,"H7","H781008001",null,null,null,null,null,null,0]
[69,"H7","H781008001",null,null,null,null,null,null,0]
[39498,"H7","H781008001",null,null,null,null,null,null,-99160]
[40,"H7","H781008002",null,null,null,null,null,null,2830839.9999999995]
[49,"H7","H781008002",null,null,null,null,null,null,0]
[50,"H7","H781008002",null,null,null,null,null,null,0]
[57,"H7","H781008002",null,null,null,null,null,null,821200]
[69,"H7","H781008002",null,null,null,null,null,null,0]
[39498,"H7","H781008002",null,null,null,null,null,null,-3652039.9999999995]
[40,"H7","H782008001",null,null,null,null,null,null,1227720]
[49,"H7","H782008001",null,null,null,null,null,null,0]
[50,"H7","H782008001",null,null,null,null,null,null,0]
[57,"H7","H782008001",null,null,null,null,null,null,2200000]
[69,"H7","H782008001",null,null,null,null,null,null,0]
[39498,"H7","H782008001",null,null,null,null,null,null,-3427720]
[40,"H7","H782008002",null,null,null,null,null,null,2397380]
[49,"H7","H782008002",null,null,null,null,null,null,0]
[50,"H7","H782008002",null,null,null,null,null,null,0]
[57,"H7","H782008002",null,null,null,null,null,null,1471160]
[69,"H7","H782008002",null,null,null,null,null,null,0]
[39498,"H7","H782008002",null,null,null,null,null,null,-3868540]
[40,"H7","H783008001",null,null,null,null,null,null,495080]
[49,"H7","H783008001",null,null,null,null,null,null,0]
[50,"H7","H783008001",null,null,null,null,null,null,0]
[57,"H7","H783008001",null,null,null,null,null,null,0]
[69,"H7","H783008001",null,null,null,null,null,null,0]
[39498,"H7","H783008001",null,null,null,null,null,null,-495080]
[40,"H7","H783008002",null,null,null,null,null,null,11881920.000000002]
[49,"H7","H783008002",null,null,null,null,null,null,0]
[50,"H7","H783008002",null,null,null,null,null,null,1524000]
[57,"H7","H783008002",null,null,null,null,null,null,4645800]
[69,"H7","H783008002",null,null,null,null,null,null,0]
[39498,"H7","H783008002",null,null,null,null,null,null,-18051720]
[40,"H7","H784008001",null,null,null,null,null,null,69640]
[49,"H7","H784008001",null,null,null,null,null,null,0]
[50,"H7","H784008001",null,null,null,null,null,null,0]
[57,"H7","H784008001",null,null,null,null,null,null,0]
[69,"H7","H784008001",null,null,null,null,null,null,0]
[39498,"H7","H784008001",null,null,null,null,null,null,-69640]
[40,"H7","H784008002",null,null,null,null,null,null,1671360.0000000005]
[49,"H7","H784008002",null,null,null,null,null,null,0]
[50,"H7","H784008002",null,null,null,null,null,null,0]
[57,"H7","H784008002",null,null,null,null,null,null,3866000]
[69,"H7","H784008002",null,null,null,null,null,null,0]
[39498,"H7","H784008002",null,null,null,null,null,null,-5537360]
[40,"H9","H981008001",null,null,null,null,null,null,638941.25459999999]
[49,"H9","H981008001",null,null,null,null,null,null,45000]
[50,"H9","H981008001",null,null,null,null,null,null,0]
[57,"H9","H981008001",null,null,null,null,null,null,171000]
[69,"H9","H981008001",null,null,null,null,null,null,0]
[39498,"H9","H981008001",null,null,null,null,null,null,-854941.25459999999]
[40,"H9","H981008002",null,null,null,null,null,null,1490862.9273999997]
[49,"H9","H981008002",null,null,null,null,null,null,105000]
[50,"H9","H981008002",null,null,null,null,null,null,0]
[57,"H9","H981008002",null,null,null,null,null,null,259000]
[69,"H9","H981008002",null,null,null,null,null,null,0]
[39498,"H9","H981008002",null,null,null,null,null,null,-1854862.9273999997]
[40,"H9","H982008001",null,null,null,null,null,null,1111718.2751999998]
[49,"H9","H982008001",null,null,null,null,null,null,0]
[50,"H9","H982008001",null,null,null,null,null,null,0]
[57,"H9","H982008001",null,null,null,null,null,null,0]
[69,"H9","H982008001",null,null,null,null,null,null,0]
[39498,"H9","H982008001",null,null,null,null,null,null,-1111718.2751999998]
[40,"H9","H982008002",null,null,null,null,null,null,1020199.8768]
[49,"H9","H982008002",null,null,null,null,null,null,10000]
[50,"H9","H982008002",null,null,null,null,null,null,0]
[57,"H9","H982008002",null,null,null,null,null,null,0]
[69,"H9","H982008002",null,null,null,null,null,null,0]
[39498,"H9","H982008002",null,null,null,null,null,null,-1030199.8768]
[40,"H9","H983008001",null,null,null,null,null,null,1773600.0202799996]
[49,"H9","H983008001",null,null,null,null,null,null,75000]
[50,"H9","H983008001",null,null,null,null,null,null,240000]
[57,"H9","H983008001",null,null,null,null,null,null,413000]
[69,"H9","H983008001",null,null,null,null,null,null,5000]
[39498,"H9","H983008001",null,null,null,null,null,null,-2506600.0202799998]
[40,"H9","H983008002",null,null,null,null,null,null,4138400.0473199994]
[49,"H9","H983008002",null,null,null,null,null,null,140000]
[50,"H9","H983008002",null,null,null,null,null,null,560000]
[57,"H9","H983008002",null,null,null,null,null,null,957000]
[69,"H9","H983008002",null,null,null,null,null,null,5000]
[39498,"H9","H983008002",null,null,null,null,null,null,-5800400.047319999]
[40,"H9","H984008001",null,null,null,null,null,null,96851.01096]
[49,"H9","H984008001",null,null,null,null,null,null,0]
[50,"H9","H984008001",null,null,null,null,null,null,0]
[57,"H9","H984008001",null,null,null,null,null,null,0]
[69,"H9","H984008001",null,null,null,null,null,null,0]
[39498,"H9","H984008001",null,null,null,null,null,null,-96851.01096]
[40,"H9","H984008002",null,null,null,null,null,null,225985.69224]
[49,"H9","H984008002",null,null,null,null,null,null,0]
[50,"H9","H984008002",null,null,null,null,null,null,0]
[57,"H9","H984008002",null,null,null,null,null,null,0]
[69,"H9","H984008002",null,null,null,null,null,null,0]
[39498,"H9","H984008002",null,null,null,null,null,null,-225985.69224]
[40,"K1","K181008001",null,null,null,null,null,null,182320]
[49,"K1","K181008001",null,null,null,null,null,null,15000]
[50,"K1","K181008001",null,null,null,null,null,null,0]
[57,"K1","K181008001",null,null,null,null,null,null,405000]
[69,"K1","K181008001",null,null,null,null,null,null,0]
[39498,"K1","K181008001",null,null,null,null,null,null,-602320]
[40,"K1","K181008002",null,null,null,null,null,null,2725779.9999999995]
[49,"K1","K181008002",null,null,null,null,null,null,175000]
[50,"K1","K181008002",null,null,null,null,null,null,25000]
[57,"K1","K181008002",null,null,null,null,null,null,110000]
[69,"K1","K181008002",null,null,null,null,null,null,0]
[39498,"K1","K181008002",null,null,null,null,null,null,-3035779.9999999995]
[40,"K1","K182008001",null,null,null,null,null,null,24240]
[49,"K1","K182008001",null,null,null,null,null,null,0]
[50,"K1","K182008001",null,null,null,null,null,null,0]
[57,"K1","K182008001",null,null,null,null,null,null,15000]
[69,"K1","K182008001",null,null,null,null,null,null,0]
[39498,"K1","K182008001",null,null,null,null,null,null,-39240]
[40,"K1","K182008002",null,null,null,null,null,null,1143650]
[49,"K1","K182008002",null,null,null,null,null,null,1000]
[50,"K1","K182008002",null,null,null,null,null,null,0]
[57,"K1","K182008002",null,null,null,null,null,null,70000]
[69,"K1","K182008002",null,null,null,null,null,null,0]
[39498,"K1","K182008002",null,null,null,null,null,null,-1214650]
[40,"K1","K181008012",null,null,null,null,null,null,0]
[49,"K1","K181008012",null,null,null,null,null,null,0]
[50,"K1","K181008012",null,null,null,null,null,null,0]
[57,"K1","K181008012",null,null,null,null,null,null,0]
[69,"K1","K181008012",null,null,null,null,null,null,0]
[39498,"K1","K181008012",null,null,null,null,null,null,0]
[40,"K1","K183008001",null,null,null,null,null,null,93880]
[49,"K1","K183008001",null,null,null,null,null,null,0]
[50,"K1","K183008001",null,null,null,null,null,null,0]
[57,"K1","K183008001",null,null,null,null,null,null,1000]
[69,"K1","K183008001",null,null,null,null,null,null,0]
[39498,"K1","K183008001",null,null,null,null,null,null,-94880]
[40,"K1","K183008002",null,null,null,null,null,null,5628750]
[49,"K1","K183008002",null,null,null,null,null,null,40000]
[50,"K1","K183008002",null,null,null,null,null,null,0]
[57,"K1","K183008002",null,null,null,null,null,null,600000]
[69,"K1","K183008002",null,null,null,null,null,null,0]
[39498,"K1","K183008002",null,null,null,null,null,null,-6268750]
[40,"K1","K184008001",null,null,null,null,null,null,83960]
[49,"K1","K184008001",null,null,null,null,null,null,0]
[50,"K1","K184008001",null,null,null,null,null,null,0]
[57,"K1","K184008001",null,null,null,null,null,null,2000]
[69,"K1","K184008001",null,null,null,null,null,null,0]
[39498,"K1","K184008001",null,null,null,null,null,null,-85960]
[40,"K1","K184008002",null,null,null,null,null,null,2860690]
[49,"K1","K184008002",null,null,null,null,null,null,310000]
[50,"K1","K184008002",null,null,null,null,null,null,0]
[57,"K1","K184008002",null,null,null,null,null,null,1600000]
[69,"K1","K184008002",null,null,null,null,null,null,90000]
[39498,"K1","K184008002",null,null,null,null,null,null,-4860690]
[40,"K2","K281008001",null,null,null,null,null,null,108960.683178204]
[49,"K2","K281008001",null,null,null,null,null,null,0]
[50,"K2","K281008001",null,null,null,null,null,null,0]
[57,"K2","K281008001",null,null,null,null,null,null,0]
[69,"K2","K281008001",null,null,null,null,null,null,0]
[39498,"K2","K281008001",null,null,null,null,null,null,-108960.683178204]
[40,"K2","K281008002",null,null,null,null,null,null,5528945.9561995557]
[49,"K2","K281008002",null,null,null,null,null,null,20000]
[50,"K2","K281008002",null,null,null,null,null,null,0]
[57,"K2","K281008002",null,null,null,null,null,null,30000]
[69,"K2","K281008002",null,null,null,null,null,null,0]
[39498,"K2","K281008002",null,null,null,null,null,null,-5578945.9561995557]
[40,"K2","K282008001",null,null,null,null,null,null,1375902.67751706]
[49,"K2","K282008001",null,null,null,null,null,null,0]
[50,"K2","K282008001",null,null,null,null,null,null,0]
[57,"K2","K282008001",null,null,null,null,null,null,33000]
[69,"K2","K282008001",null,null,null,null,null,null,0]
[39498,"K2","K282008001",null,null,null,null,null,null,-1408902.67751706]
[40,"K2","K282008002",null,null,null,null,null,null,6811531.311184519]
[49,"K2","K282008002",null,null,null,null,null,null,0]
[50,"K2","K282008002",null,null,null,null,null,null,0]
[57,"K2","K282008002",null,null,null,null,null,null,80000]
[69,"K2","K282008002",null,null,null,null,null,null,0]
[39498,"K2","K282008002",null,null,null,null,null,null,-6891531.311184519]
[40,"K2","K283008001",null,null,null,null,null,null,147421.54111317598]
[49,"K2","K283008001",null,null,null,null,null,null,0]
[50,"K2","K283008001",null,null,null,null,null,null,0]
[57,"K2","K283008001",null,null,null,null,null,null,0]
[69,"K2","K283008001",null,null,null,null,null,null,0]
[39498,"K2","K283008001",null,null,null,null,null,null,-147421.54111317598]
[40,"K2","K283008002",null,null,null,null,null,null,13735944.746924929]
[49,"K2","K283008002",null,null,null,null,null,null,50000]
[50,"K2","K283008002",null,null,null,null,null,null,7000]
[57,"K2","K283008002",null,null,null,null,null,null,1300000]
[69,"K2","K283008002",null,null,null,null,null,null,0]
[39498,"K2","K283008002",null,null,null,null,null,null,-15092944.746924929]
[40,"K2","K284008001",null,null,null,null,null,null,62336.011124244003]
[49,"K2","K284008001",null,null,null,null,null,null,0]
[50,"K2","K284008001",null,null,null,null,null,null,0]
[57,"K2","K284008001",null,null,null,null,null,null,0]
[69,"K2","K284008001",null,null,null,null,null,null,0]
[39498,"K2","K284008001",null,null,null,null,null,null,-62336.011124244003]
[40,"K2","K284008002",null,null,null,null,null,null,1658709.3852542399]
[49,"K2","K284008002",null,null,null,null,null,null,270000]
[50,"K2","K284008002",null,null,null,null,null,null,200000]
[57,"K2","K284008002",null,null,null,null,null,null,1460000]
[69,"K2","K284008002",null,null,null,null,null,null,45000]
[39498,"K2","K284008002",null,null,null,null,null,null,-3633709.3852542397]
[40,"K6","K681008001",null,null,null,null,null,null,203300]
[49,"K6","K681008001",null,null,null,null,null,null,5000]
[50,"K6","K681008001",null,null,null,null,null,null,160000]
[57,"K6","K681008001",null,null,null,null,null,null,15000]
[69,"K6","K681008001",null,null,null,null,null,null,0]
[39498,"K6","K681008001",null,null,null,null,null,null,-383300]
[40,"K6","K681008002",null,null,null,null,null,null,2308700]
[49,"K6","K681008002",null,null,null,null,null,null,15000]
[50,"K6","K681008002",null,null,null,null,null,null,700000]
[57,"K6","K681008002",null,null,null,null,null,null,90000]
[69,"K6","K681008002",null,null,null,null,null,null,0]
[39498,"K6","K681008002",null,null,null,null,null,null,-3113700]
[40,"K6","K682008001",null,null,null,null,null,null,704300]
[49,"K6","K682008001",null,null,null,null,null,null,30000]
[50,"K6","K682008001",null,null,null,null,null,null,0]
[57,"K6","K682008001",null,null,null,null,null,null,380000]
[69,"K6","K682008001",null,null,null,null,null,null,0]
[39498,"K6","K682008001",null,null,null,null,null,null,-1114300]
[40,"K6","K682008002",null,null,null,null,null,null,1573700]
[49,"K6","K682008002",null,null,null,null,null,null,10000]
[50,"K6","K682008002",null,null,null,null,null,null,0]
[57,"K6","K682008002",null,null,null,null,null,null,20000]
[69,"K6","K682008002",null,null,null,null,null,null,0]
[39498,"K6","K682008002",null,null,null,null,null,null,-1603700]
[40,"K6","K683008001",null,null,null,null,null,null,492700]
[49,"K6","K683008001",null,null,null,null,null,null,0]
[50,"K6","K683008001",null,null,null,null,null,null,0]
[57,"K6","K683008001",null,null,null,null,null,null,50000]
[69,"K6","K683008001",null,null,null,null,null,null,0]
[39498,"K6","K683008001",null,null,null,null,null,null,-542700]
[40,"K6","K683008002",null,null,null,null,null,null,6740800]
[49,"K6","K683008002",null,null,null,null,null,null,25000]
[50,"K6","K683008002",null,null,null,null,null,null,0]
[57,"K6","K683008002",null,null,null,null,null,null,650000]
[69,"K6","K683008002",null,null,null,null,null,null,0]
[39498,"K6","K683008002",null,null,null,null,null,null,-7415800]
[40,"K6","K684008001",null,null,null,null,null,null,249700]
[49,"K6","K684008001",null,null,null,null,null,null,0]
[50,"K6","K684008001",null,null,null,null,null,null,0]
[57,"K6","K684008001",null,null,null,null,null,null,20000]
[69,"K6","K684008001",null,null,null,null,null,null,0]
[39498,"K6","K684008001",null,null,null,null,null,null,-269700]
[40,"K6","K684008002",null,null,null,null,null,null,2045899.9999999998]
[49,"K6","K684008002",null,null,null,null,null,null,5000]
[50,"K6","K684008002",null,null,null,null,null,null,0]
[57,"K6","K684008002",null,null,null,null,null,null,520000]
[69,"K6","K684008002",null,null,null,null,null,null,30000]
[39498,"K6","K684008002",null,null,null,null,null,null,-2600900]
[40,"K7","K781008001",null,null,null,null,null,null,183745.819686]
[49,"K7","K781008001",null,null,null,null,null,null,0]
[50,"K7","K781008001",null,null,null,null,null,null,0]
[57,"K7","K781008001",null,null,null,null,null,null,0]
[69,"K7","K781008001",null,null,null,null,null,null,0]
[39498,"K7","K781008001",null,null,null,null,null,null,-183745.819686]
[40,"K7","K781008002",null,null,null,null,null,null,2695003.801314]
[49,"K7","K781008002",null,null,null,null,null,null,300000]
[50,"K7","K781008002",null,null,null,null,null,null,0]
[57,"K7","K781008002",{"$f":"RIGHT(C946,6)","v":"008002"},null,null,null,null,null,750000]
[69,"K7","K781008002","008002",null,null,null,null,null,0]
[39498,"K7","K781008002","008002",null,null,null,null,null,-3745003.801314]
[40,"K7","K782008001","008001",null,null,null,null,null,0]
[49,"K7","K782008001","008001",null,null,null,null,null,0]
[50,"K7","K782008001","008001",null,null,null,null,null,0]
[57,"K7","K782008001","008001",null,null,null,null,null,0]
[69,"K7","K782008001","008001",null,null,null,null,null,0]
[39498,"K7","K782008001","008001",null,null,null,null,null,0]
[40,"K7","K782008002","008002",null,null,null,null,null,606859.96799999999]
[49,"K7","K782008002","008002",null,null,null,null,null,0]
[50,"K7","K782008002","008002",null,null,null,null,null,0]
[57,"K7","K782008002","008002",null,null,null,null,null,0]
[69,"K7","K782008002","008002",null,null,null,null,null,0]
[39498,"K7","K782008002","008002",null,null,null,null,null,-606859.96799999999]
[40,"K7","K783008001","008001",null,null,null,null,null,65047.802820000004]
[49,"K7","K783008001","008001",null,null,null,null,null,4000]
[50,"K7","K783008001","008001",null,null,null,null,null,0]
[57,"K7","K783008001","008001",null,null,null,null,null,0]
[69,"K7","K783008001","008001",null,null,null,null,null,0]
[39498,"K7","K783008001","008001",null,null,null,null,null,-69047.802820000012]
[40,"K7","K783008002","008002",null,null,null,null,null,10004547.975699419]
[49,"K7","K783008002","008002",null,null,null,null,null,275000]
[50,"K7","K783008002","008002",null,null,null,null,null,0]
[57,"K7","K783008002","008002",null,null,null,null,null,648000]
[69,"K7","K783008002","008002",null,null,null,null,null,0]
[39498,"K7","K783008002","008002",null,null,null,null,null,-10927547.975699419]
[40,"K7","K784008001","008001",null,null,null,null,null,17143.794096000001]
[49,"K7","K784008001","008001",null,null,null,null,null,0]
[50,"K7","K784008001","008001",null,null,null,null,null,0]
[57,"K7","K784008001","008001",null,null,null,null,null,0]
[69,"K7","K784008001","008001",null,null,null,null,null,0]
[39498,"K7","K784008001","008001",null,null,null,null,null,-17143.794096000001]
[40,"K7","K784008002","008002",null,null,null,null,null,1275507.8241048001]
[49,"K7","K784008002","008002",null,null,null,null,null,2000]
[50,"K7","K784008002","008002",null,null,null,null,null,10000]
[57,"K7","K784008002","008002",null,null,null,null,null,523000]
[69,"K7","K784008002","008002",null,null,null,null,null,0]
[39498,"K7","K784008002","008002",null,null,null,null,null,-1810507.8241048001]
[40,"K8","K881008001","008001",null,null,null,null,null,367800]
[49,"K8","K881008001","008001",null,null,null,null,null,0]
[50,"K8","K881008001","008001",null,null,null,null,null,0]
[57,"K8","K881008001","008001",null,null,null,null,null,10000]
[69,"K8","K881008001","008001",null,null,null,null,null,0]
[39498,"K8","K881008001","008001",null,null,null,null,null,-377800]
[40,"K8","K881008002","008002",null,null,null,null,null,2507700]
[49,"K8","K881008002","008002",null,null,null,null,null,0]
[50,"K8","K881008002","008002",null,null,null,null,null,70000]
[57,"K8","K881008002","008002",null,null,null,null,null,170000]
[69,"K8","K881008002","008002",null,null,null,null,null,0]
[39498,"K8","K881008002","008002",null,null,null,null,null,-2747700]
[40,"K8","K882008001","008001",null,null,null,null,null,433799.99999999994]
[49,"K8","K882008001",{"$f":"RIGHT(C998,6)","v":"008001"},null,null,null,null,null,0]
[50,"K8","K882008001","008001",null,null,null,null,null,0]
[57,"K8","K882008001","008001",null,null,null,null,null,60000]
[69,"K8","K882008001","008001",null,null,null,null,null,0]
[39498,"K8","K882008001","008001",null,null,null,null,null,-493799.99999999994]
[40,"K8","K882008002","008002",null,null,null,null,null,1335000]
[49,"K8","K882008002","008002",null,null,null,null,null,0]
[50,"K8","K882008002","008002",null,null,null,null,null,0]
[57,"K8","K882008002","008002",null,null,null,null,null,60000]
[69,"K8","K882008002","008002",null,null,null,null,null,0]
[39498,"K8","K882008002","008002",null,null,null,null,null,-1395000]
[40,"K8","K883008001","008001",null,null,null,null,null,2009600]
[49,"K8","K883008001","008001",null,null,null,null,null,0]
[50,"K8","K883008001","008001",null,null,null,null,null,200000]
[57,"K8","K883008001","008001",null,null,null,null,null,110000]
[69,"K8","K883008001","008001",null,null,null,null,null,0]
[39498,"K8","K883008001","008001",null,null,null,null,null,-2319600]
[40,"K8","K883008002","008002",null,null,null,null,null,11153000]
[49,"K8","K883008002","008002",null,null,null,null,null,0]
[50,"K8","K883008002","008002",null,null,null,null,null,1600000]
[57,"K8","K883008002","008002",null,null,null,null,null,1000000]
[69,"K8","K883008002","008002",null,null,null,null,null,10000]
[39498,"K8","K883008002","008002",null,null,null,null,null,-13763000]
[40,"K8","K884008001","008001",null,null,null,null,null,334400]
[49,"K8","K884008001","008001",null,null,null,null,null,0]
[50,"K8","K884008001","008001",null,null,null,null,null,20000]
[57,"K8","K884008001","008001",null,null,null,null,null,20000]
[69,"K8","K884008001","008001",null,null,null,null,null,0]
[39498,"K8","K884008001","008001",null,null,null,null,null,-374400]
[40,"K8","K884008002","008002",null,null,null,null,null,2587799.9999999995]
[49,"K8","K884008002","008002",null,null,null,null,null,0]
[50,"K8","K884008002","008002",null,null,null,null,null,25000]
[57,"K8","K884008002","008002",null,null,null,null,null,60000]
[69,"K8","K884008002","008002",null,null,null,null,null,0]
[39498,"K8","K884008002","008002",null,null,null,null,null,-2672799.9999999995]
[40,"K9","K981008001","008001",null,null,null,null,null,521507.24160000007]
[49,"K9","K981008001","008001",null,null,null,null,null,0]
[50,"K9","K981008001","008001",null,null,null,null,null,0]
[57,"K9","K981008001","008001",null,null,null,null,null,0]
[69,"K9","K981008001","008001",null,null,null,null,null,0]
[39498,"K9","K981008001","008001",null,null,null,null,null,-521507.24160000007]
[40,"K9","K981008002","008002",null,null,null,null,null,2407935.0624000002]
[49,"K9","K981008002","008002",null,null,null,null,null,0]
[50,"K9","K981008002","008002",null,null,null,null,null,0]
[57,"K9","K981008002","008002",null,null,null,null,null,0]
[69,"K9","K981008002","008002",null,null,null,null,null,0]
[39498,"K9","K981008002","008002",null,null,null,null,null,-2407935.0624000002]
[40,"K9","K982008001","008001",null,null,null,null,null,185430.20159999997]
[49,"K9","K982008001","008001",null,null,null,null,null,0]
[50,"K9","K982008001","008001",null,null,null,null,null,0]
[57,"K9","K982008001","008001",null,null,null,null,null,0]
[69,"K9","K982008001","008001",null,null,null,null,null,0]
[39498,"K9","K982008001","008001",null,null,null,null,null,-185430.20159999997]
[40,"K9","K982008002","008002",null,null,null,null,null,999017.37600000005]
[49,"K9","K982008002","008002",null,null,null,null,null,0]
[50,"K9","K982008002","008002",null,null,null,null,null,0]
[57,"K9","K982008002","008002",null,null,null,null,null,60000]
[69,"K9","K982008002","008002",null,null,null,null,null,0]
[39498,"K9","K982008002","008002",null,null,null,null,null,-1059017.3760000002]
[40,"K9","K983008001","008001",null,null,null,null,null,455003.94240000006]
[49,"K9","K983008001","008001",null,null,null,null,null,0]
[50,"K9","K983008001","008001",null,null,null,null,null,0]
[57,"K9","K983008001","008001",null,null,null,null,null,0]
[69,"K9","K983008001","008001",null,null,null,null,null,0]
[39498,"K9","K983008001",{"$f":"RIGHT(C1062,6)","v":"008001"},null,null,null,null,null,-455003.94240000006]
[40,"K9","K983008002","008002",null,null,null,null,null,6390080.4576000012]
[49,"K9","K983008002","008002",null,null,null,null,null,0]
[50,"K9","K983008002","008002",null,null,null,null,null,0]
[57,"K9","K983008002","008002",null,null,null,null,null,190000]
[69,"K9","K983008002","008002",null,null,null,null,null,0]
[39498,"K9","K983008002","008002",null,null,null,null,null,-6580080.4576000012]
[40,"K9","K984008001","008001",null,null,null,null,null,0]
[49,"K9","K984008001","008001",null,null,null,null,null,0]
[50,"K9","K984008001","008001",null,null,null,null,null,0]
[57,"K9","K984008001","008001",null,null,null,null,null,0]
[69,"K9","K984008001","008001",null,null,null,null,null,0]
[39498,"K9","K984008001","008001",null,null,null,null,null,0]
[40,"K9","K984008002","008002",null,null,null,null,null,0]
[49,"K9","K984008002","008002",null,null,null,null,null,0]
[50,"K9","K984008002","008002",null,null,null,null,null,0]
[57,"K9","K984008002","008002",null,null,null,null,null,1020000]
[69,"K9","K984008002","008002",null,null,null,null,null,0]
[39498,"K9","K984008002","008002",null,null,null,null,null,-1020000]
[40,"OF","OF81008001","008001",null,null,null,null,null,249562.01251219233]
[49,"OF","OF81008001","008001",null,null,null,null,null,94466.32]
[50,"OF","OF81008001","008001",null,null,null,null,null,129088.66750000001]
[57,"OF","OF81008001","008001",null,null,null,null,null,43120.885600000001]
[69,"OF","OF81008001","008001",null,null,null,null,null,5214.8200000000006]
[39498,"OF","OF81008001","008001",null,null,null,null,null,-521452.70561219228]
[40,"OF","OF81008002","008002",null,null,null,null,null,464013.54885809997]
[49,"OF","OF81008002","008002",null,null,null,null,null,72666.399999999994]
[50,"OF","OF81008002","008002",null,null,null,null,null,99298.975000000006]
[57,"OF","OF81008002","008002",null,null,null,null,null,549169.91200000001]
[69,"OF","OF81008002","008002",null,null,null,null,null,4011.4]
[39498,"OF","OF81008002","008002",null,null,null,null,null,-1189160.2358581]
[40,"OF","OF89008282","008282",null,null,null,null,null,0]
[49,"OF","OF89008282","008282",null,null,null,null,null,0]
[50,"OF","OF89008282","008282",null,null,null,null,null,0]
[57,"OF","OF89008282","008282",null,null,null,null,null,0]
[69,"OF","OF89008282","008282",null,null,null,null,null,0]
[39498,"OF","OF89008282","008282",null,null,null,null,null,0]
[40,"OF","OF82008001","008001",null,null,null,null,null,309731.74979448179]
[49,"OF","OF82008001","008001",null,null,null,null,null,150]
[50,"OF","OF82008001","008001",null,null,null,null,null,5106.9359999999997]
[57,"OF","OF82008001","008001",null,null,null,null,null,8029.0800000000008]
[69,"OF","OF82008001","008001",null,null,null,null,null,0]
[39498,"OF","OF82008001","008001",null,null,null,null,null,-323017.76579448179]
[40,"OF","OF82008002","008002",null,null,null,null,null,1125662.229978]
[49,"OF","OF82008002","008002",null,null,null,null,null,862.8]
[50,"OF","OF82008002","008002",null,null,null,null,null,56256.56]
[57,"OF","OF82008002","008002",null,null,null,null,null,19507.339999999997]
[69,"OF","OF82008002","008002",null,null,null,null,null,0]
[39498,"OF","OF82008002","008002",null,null,null,null,null,-1202288.9299780002]
[40,"OF","OF83008001","008001",null,null,null,null,null,200931.44397593266]
[49,"OF","OF83008001","008001",null,null,null,null,null,17989.4171652]
[50,"OF","OF83008001","008001",null,null,null,null,null,39458.650140000005]
[57,"OF","OF83008001","008001",null,null,null,null,null,52852.800000000003]
[69,"OF","OF83008001","008001",null,null,null,null,null,0]
[39498,"OF","OF83008001","008001",null,null,null,null,null,-311232.31128113269]
[40,"OF","OF83008002","008002",null,null,null,null,null,373594.16787]
[49,"OF","OF83008002","008002",null,null,null,null,null,13838.013203999999]
[50,"OF","OF83008002","008002",null,null,null,null,null,30352.807800000006]
[57,"OF","OF83008002","008002",null,null,null,null,null,40656]
[69,"OF","OF83008002","008002",null,null,null,null,null,0]
[39498,"OF","OF83008002","008002",null,null,null,null,null,-458440.98887400003]
[40,"OF","OF83008011","008011",null,null,null,null,null,243073.19589847833]
[49,"OF","OF83008011","008011",null,null,null,null,null,38282.400000000001]
[50,"OF","OF83008011","008011",null,null,null,null,null,31775.835000000003]
[57,"OF","OF83008011",{"$f":"RIGHT(C1126,6)","v":"008011"},null,null,null,null,null,21342.1]
[69,"OF","OF83008011","008011",null,null,null,null,null,0]
[39498,"OF","OF83008011","008011",null,null,null,null,null,-334473.53089847835]
[40,"OF","OF83008012","008012",null,null,null,null,null,451948.81675199996]
[49,"OF","OF83008012","008012",null,null,null,null,null,29448]
[50,"OF","OF83008012","008012",null,null,null,null,null,24442.95]
[57,"OF","OF83008012","008012",null,null,null,null,null,16417]
[69,"OF","OF83008012","008012",null,null,null,null,null,0]
[39498,"OF","OF83008012","008012",null,null,null,null,null,-522256.76675199997]
[40,"OF","OF84008001","008001",null,null,null,null,null,182889.38333186947]
[49,"OF","OF84008001","008001",null,null,null,null,null,6110]
[50,"OF","OF84008001","008001",null,null,null,null,null,247584.63756000003]
[57,"OF","OF84008001","008001",null,null,null,null,null,287592.6274]
[69,"OF","OF84008001","008001",null,null,null,null,null,5200]
[39498,"OF","OF84008001","008001",null,null,null,null,null,-729376.64829186955]
[40,"OF","OF84008002","008002",null,null,null,null,null,375498.18160799996]
[49,"OF","OF84008002","008002",null,null,null,null,null,4700]
[50,"OF","OF84008002","008002",null,null,null,null,null,190449.72120000003]
[57,"OF","OF84008002","008002",null,null,null,null,null,221225.098]
[69,"OF","OF84008002","008002",null,null,null,null,null,4000]
[39498,"OF","OF84008002","008002",null,null,null,null,null,-795873.00080799998]
[40,"OF","OF84008011","008011",null,null,null,null,null,189856.93997177537]
[49,"OF","OF84008011","008011",null,null,null,null,null,4420]
[50,"OF","OF84008011","008011",null,null,null,null,null,43097.212599999999]
[57,"OF","OF84008011","008011",null,null,null,null,null,187960.5]
[69,"OF","OF84008011","008011",null,null,null,null,null,10265.4]
[39498,"OF","OF84008011","008011",null,null,null,null,null,-435600.05257177539]
[40,"OF","OF84008012","008012",null,null,null,null,null,353003.21393000003]
[49,"OF","OF84008012","008012",null,null,null,null,null,3400]
[50,"OF","OF84008012","008012",null,null,null,null,null,33151.702000000005]
[57,"OF","OF84008012","008012",null,null,null,null,null,144585]
[69,"OF","OF84008012","008012",null,null,null,null,null,0]
[39498,"OF","OF84008012","008012",null,null,null,null,null,-534139.91593000002]
[40,"OV","OV81008001","008001",null,null,null,null,null,2737679.9382627895]
[49,"OV","OV81008001","008001",null,null,null,null,null,428731.76]
[50,"OV","OV81008001","008001",null,null,null,null,null,585863.95250000001]
[57,"OV","OV81008001","008001",null,null,null,null,null,204993.62079999998]
[69,"OV","OV81008001","008001",null,null,null,null,null,23667.26]
[39498,"OV","OV81008001","008001",null,null,null,null,null,-3980936.5315627893]
[40,"OV","OV81008002","008002",null,null,null,null,null,835224.38794457994]
[49,"OV","OV81008002","008002",null,null,null,null,null,130799.52]
[50,"OV","OV81008002","008002",null,null,null,null,null,178738.155]
[57,"OV","OV81008002","008002",null,null,null,null,null,59705.8416]
[69,"OV","OV81008002","008002",null,null,null,null,null,7220.5199999999995]
[39498,"OV","OV81008002","008002",null,null,null,null,null,-1211688.4245445798]
[40,"OV","OV82008001","008001",null,null,null,null,null,0]
[49,"OV","OV82008001","008001",null,null,null,null,null,0]
[50,"OV","OV82008001","008001",null,null,null,null,null,0]
[57,"OV","OV82008001","008001",null,null,null,null,null,0]
[69,"OV","OV82008001","008001",null,null,null,null,null,0]
[39498,"OV","OV82008001","008001",null,null,null,null,null,0]
[40,"OV","OV82008002","008002",null,null,null,null,null,0]
[49,"OV","OV82008002","008002",null,null,null,null,null,0]
[50,"OV","OV82008002","008002",null,null,null,null,null,0]
[57,"OV","OV82008002","008002",null,null,null,null,null,0]
[69,"OV","OV82008002","008002",null,null,null,null,null,0]
[39498,"OV","OV82008002","008002",null,null,null,null,null,0]
[40,"OV","OV83008001","008001",null,null,null,null,null,2204205.5904329997]
[49,"OV","OV83008001","008001",null,null,null,null,null,81644.277903599999]
[50,"OV","OV83008001","008001",null,null,null,null,null,179081.56602]
[57,"OV","OV83008001","008001",null,null,null,null,null,247622.39999999999]
[69,"OV","OV83008001","008001",null,null,null,null,null,0]
[39498,"OV","OV83008001","008001",null,null,null,null,null,-2712553.8343565995]
[40,"OV","OV83008002","008002",null,null,null,null,null,672469.50216599996]
[49,"OV","OV83008002",{"$f":"RIGHT(C1190,6)","v":"008002"},null,null,null,null,null,24908.423767199998]
[50,"OV","OV83008002","008002",null,null,null,null,null,54635.054040000003]
[57,"OV","OV83008002","008002",null,null,null,null,null,73180.799999999988]
[69,"OV","OV83008002","008002",null,null,null,null,null,0]
[39498,"OV","OV83008002","008002",null,null,null,null,null,-825193.77997319982]
[40,"OV","OV83008011","008011",null,null,null,null,null,2666498.0188367995]
[49,"OV","OV83008011","008011",null,null,null,null,null,173743.2]
[50,"OV","OV83008011","008011",null,null,null,null,null,144213.405]
[57,"OV","OV83008011","008011",null,null,null,null,null,107860.3]
[69,"OV","OV83008011","008011",null,null,null,null,null,0]
[39498,"OV","OV83008011","008011",null,null,null,null,null,-3092314.9238367993]
[40,"OV","OV83008012","008012",null,null,null,null,null,813507.87015359988]
[49,"OV","OV83008012","008012",null,null,null,null,null,53006.400000000001]
[50,"OV","OV83008012","008012",null,null,null,null,null,43997.31]
[57,"OV","OV83008012","008012",null,null,null,null,null,29550.6]
[69,"OV","OV83008012","008012",null,null,null,null,null,0]
[39498,"OV","OV83008012","008012",null,null,null,null,null,-940062.18015359982]
[40,"OV","OV84008001","008001",null,null,null,null,null,2186194.1437564795]
[49,"OV","OV84008001","008001",null,null,null,null,null,27730]
[50,"OV","OV84008001","008001",null,null,null,null,null,1123653.3550800001]
[57,"OV","OV84008001","008001",null,null,null,null,null,1305228.0782000001]
[69,"OV","OV84008001","008001",null,null,null,null,null,87501.4]
[39498,"OV","OV84008001","008001",null,null,null,null,null,-4730306.9770364799]
[40,"OV","OV84008002","008002",null,null,null,null,null,679813.83481440006]
[49,"OV","OV84008002","008002",null,null,null,null,null,8460]
[50,"OV","OV84008002","008002",null,null,null,null,null,342809.49816000008]
[57,"OV","OV84008002","008002",null,null,null,null,null,398205.1764]
[69,"OV","OV84008002","008002",null,null,null,null,null,13200]
[39498,"OV","OV84008002","008002",null,null,null,null,null,-1442488.5093744001]
[40,"OV","OV84008011","008011",null,null,null,null,null,2082718.9621869999]
[49,"OV","OV84008011","008011",null,null,null,null,null,20060]
[50,"OV","OV84008011","008011",null,null,null,null,null,195595.04179999998]
[57,"OV","OV84008011","008011",null,null,null,null,null,893051.5]
[69,"OV","OV84008011","008011",null,null,null,null,null,0]
[39498,"OV","OV84008011","008011",null,null,null,null,null,-3191425.5039869994]
[40,"OV","OV84008012","008012",null,null,null,null,null,635405.7850739999]
[49,"OV","OV84008012","008012",null,null,null,null,null,6120]
[50,"OV","OV84008012","008012",null,null,null,null,null,59673.063599999994]
[57,"OV","OV84008012","008012",null,null,null,null,null,260253]
[69,"OV","OV84008012","008012",null,null,null,null,null,0]
[39498,"OV","OV84008012","008012",null,null,null,null,null,-961451.84867399989]
[40,"S1","S181008001","008001",null,null,null,null,null,1142992.4006879998]
[49,"S1","S181008001","008001",null,null,null,null,null,143229.24]
[50,"S1","S181008001","008001",null,null,null,null,null,0]
[57,"S1","S181008001","008001",null,null,null,null,null,84394.08]
[69,"S1","S181008001","008001",null,null,null,null,null,0]
[39498,"S1","S181008001","008001",null,null,null,null,null,-1370615.7206879999]
[40,"S1","S181008002","008002",null,null,null,null,null,1450199.4032160002]
[49,"S1","S181008002","008002",null,null,null,null,null,0]
[50,"S1","S181008002","008002",null,null,null,null,null,0]
[57,"S1","S181008002","008002",null,null,null,null,null,0]
[69,"S1","S181008002","008002",null,null,null,null,null,0]
[39498,"S1","S181008002","008002",null,null,null,null,null,-1450199.4032160002]
[40,"S1","S182008001","008001",null,null,null,null,null,617007.5703720001]
[49,"S1","S182008001","008001",null,null,null,null,null,0]
[50,"S1","S182008001","008001",null,null,null,null,null,0]
[57,"S1","S182008001","008001",null,null,null,null,null,0]
[69,"S1","S182008001","008001",null,null,null,null,null,0]
[39498,"S1","S182008001","008001",null,null,null,null,null,-617007.5703720001]
[40,"S1","S182008002","008002",null,null,null,null,null,996855.79312800011]
[49,"S1","S182008002","008002",null,null,null,null,null,0]
[50,"S1","S182008002","008002",null,null,null,null,null,0]
[57,"S1","S182008002","008002",null,null,null,null,null,0]
[69,"S1","S182008002","008002",null,null,null,null,null,0]
[39498,"S1","S182008002",{"$f":"RIGHT(C1254,6)","v":"008002"},null,null,null,null,null,-996855.79312800011]
[40,"S1","S183008001","008001",null,null,null,null,null,523508.17354200012]
[49,"S1","S183008001","008001",null,null,null,null,null,0]
[50,"S1","S183008001","008001",null,null,null,null,null,0]
[57,"S1","S183008001","008001",null,null,null,null,null,0]
[69,"S1","S183008001","008001",null,null,null,null,null,0]
[39498,"S1","S183008001","008001",null,null,null,null,null,-523508.17354200012]
[40,"S1","S183008002","008002",null,null,null,null,null,2160385.2207000004]
[49,"S1","S183008002","008002",null,null,null,null,null,0]
[50,"S1","S183008002","008002",null,null,null,null,null,0]
[57,"S1","S183008002","008002",null,null,null,null,null,0]
[69,"S1","S183008002","008002",null,null,null,null,null,0]
[39498,"S1","S183008002","008002",null,null,null,null,null,-2160385.2207000004]
[40,"S1","S184008001","008001",null,null,null,null,null,119273.78895299998]
[49,"S1","S184008001","008001",null,null,null,null,null,55000]
[50,"S1","S184008001","008001",null,null,null,null,null,41000]
[57,"S1","S184008001","008001",null,null,null,null,null,250000]
[69,"S1","S184008001","008001",null,null,null,null,null,0]
[39498,"S1","S184008001","008001",null,null,null,null,null,-465273.78895299998]
[40,"S1","S184008002","008002",null,null,null,null,null,159922.21241699997]
[49,"S1","S184008002","008002",null,null,null,null,null,19000]
[50,"S1","S184008002","008002",null,null,null,null,null,0]
[57,"S1","S184008002","008002",null,null,null,null,null,208000]
[69,"S1","S184008002","008002",null,null,null,null,null,0]
[39498,"S1","S184008002","008002",null,null,null,null,null,-386922.21241699997]
[40,"TL","TL81008001","008001",null,null,null,null,null,1109300]
[49,"TL","TL81008001","008001",null,null,null,null,null,20000]
[50,"TL","TL81008001","008001",null,null,null,null,null,0]
[57,"TL","TL81008001","008001",null,null,null,null,null,250000]
[69,"TL","TL81008001","008001",null,null,null,null,null,0]
[39498,"TL","TL81008001","008001",null,null,null,null,null,-1379300]
[40,"TL","TL81008002","008002",null,null,null,null,null,196799.99999999997]
[49,"TL","TL81008002","008002",null,null,null,null,null,15000]
[50,"TL","TL81008002","008002",null,null,null,null,null,0]
[57,"TL","TL81008002","008002",null,null,null,null,null,10000]
[69,"TL","TL81008002","008002",null,null,null,null,null,0]
[39498,"TL","TL81008002","008002",null,null,null,null,null,-221799.99999999997]
[40,"TL","TL82008001","008001",null,null,null,null,null,172200.00000000003]
[49,"TL","TL82008001","008001",null,null,null,null,null,1000]
[50,"TL","TL82008001","008001",null,null,null,null,null,0]
[57,"TL","TL82008001","008001",null,null,null,null,null,20000]
[69,"TL","TL82008001","008001",null,null,null,null,null,0]
[39498,"TL","TL82008001","008001",null,null,null,null,null,-193200.00000000003]
[40,"TL","TL82008002","008002",null,null,null,null,null,172200.00000000003]
[49,"TL","TL82008002","008002",null,null,null,null,null,1000]
[50,"TL","TL82008002","008002",null,null,null,null,null,0]
[57,"TL","TL82008002","008002",null,null,null,null,null,3000]
[69,"TL","TL82008002","008002",null,null,null,null,null,0]
[39498,"TL","TL82008002","008002",null,null,null,null,null,-176200.00000000003]
[40,"TL","TL83008001","008001",null,null,null,null,null,1439399.9999999998]
[49,"TL","TL83008001","008001",null,null,null,null,null,1000]
[50,"TL","TL83008001","008001",null,null,null,null,null,130000]
[57,"TL","TL83008001","008001",null,null,null,null,null,139000]
[69,"TL","TL83008001","008001",null,null,null,null,null,0]
[39498,"TL","TL83008001","008001",null,null,null,null,null,-1709399.9999999998]
[40,"TL","TL83008002","008002",null,null,null,null,null,267100]
[49,"TL","TL83008002","008002",null,null,null,null,null,1000]
[50,"TL","TL83008002","008002",null,null,null,null,null,0]
[57,"TL","TL83008002","008002",null,null,null,null,null,12000]
[69,"TL","TL83008002","008002",null,null,null,null,null,0]
[39498,"TL","TL83008002","008002",null,null,null,null,null,-280100]
[null,null,null,""]
[null,null,null,""]
[null,null,null,""]
[null,null,null,{"$f":"RIGHT(C1318,6)","v":""}]
[null,null,null,""]
[null,null,null,""]
[null,null,null,""]
[null,null,null,""]
[null,null,null,""]
[null,null,null,""]
[null,null,null,""]
[null,null,null,""]
[null,null,null,""]
[null,null,null,""]
[null,null,null,""]
[null,null,null,""]
[null,null,null,""]
[null,null,null,""]
[null,null,null,""]
[null,null,null,""]
[null,null,null,""]
[null,null,null,""]
[null,null,null,""]
[null,null,null,""]
[null,null,null,""]
[null,null,null,""]
[null,null,null,""]
[null,null,null,""]
[null,null,null,""]
[null,null,null,""]
[null,null,null,""]
[null,null,null,""]
[null,null,null,""]
[null,null,null,""]
[null,null,null,""]
[null,null,null,""]
[null,null,null,""]
[null,null,null,""]
[null,null,null,""]
[null,null,null,""]
[null,null,null,""]
[null,null,null,""]
[null,null,null,""]
[null,null,null,""]
[null,null,null,""]
[null,null,null,""]
[null,null,null,""]
[null,null,null,""]
[null,null,null,""]
[null,null,null,""]
[null,null,null,""]
[null,null,null,""]
[null,null,null,""]
[null,null,null,""]
[null,null,null,""]
[null,null,null,""]
[null,null,null,""]
[null,null,null,""]
[null,null,null,""]
[null,null,null,""]
[null,null,null,""]
[null,null,null,""]